{"text_format":"1","workbook":"xlsx","n_sheets":23,"sheets":["Intro","Accueil","Descriptif site","TechniquesHS","TechniquesOS","TechniquesIS","TechniquesE","Scenarios","Eval_cout","Eval_env","Eval_soc","Synthese","Resultats","DonnéesFinales","Pond_glob","Agg-Finale","Aggre - Envi","Aggre - Soc","Coûts","Envi-Loc","Envi-Glob","Soc-Loc","Soc-Glob"],"not_rendered":{"charts":8,"images":10,"macros":1,"external_links":0,"defined_names":29,"comments":0,"pivot_tables":0},"unopened":[],"bounds":{"document_bytes":16777216,"sheet_cells":100000,"rows_first":2000,"rows_last":500,"rows_between":2000,"halvings":0,"cell_chars":16384,"cell_head_chars":4096},"cells_cut":0,"cells_raw":0,"read":"whole","date_system":"1900"}

{"sheet":"Intro","index":0,"n_rows":46,"n_cols":28,"rows_kept":46,"cut":false,"hidden":false,"merged":[[19,3,19,10],[36,3,36,9],[38,3,38,9],[40,3,40,9],[28,3,28,9],[30,3,30,9],[32,3,32,9],[34,3,34,9],[26,3,26,10]]}
[null,null,null,null,null,null,null,null,null,null,null,null,null,null,null,null,null,null,null,null,null,{"$f":"Accueil!V1","v":0},{"$f":"Accueil!W1","v":0},{"$f":"Accueil!X1","v":0}]
[null,null,null,null,null,null,null,null,null,null,null,null,null,null,null,null,null,null,null,null,null,{"$f":"Accueil!V2","v":"Choix variantes"},{"$f":"Accueil!W2","v":1},{"$f":"Accueil!X2","v":0}]
[null,null,null,null,null,null,null,null,null,null,null,null,null,null,null,null,null,null,null,null,null,{"$f":"Accueil!V3","v":"Acuueil"},{"$f":"Accueil!W3","v":1},{"$f":"Accueil!X3","v":0}]
[null,null,null,null,null,null,null,null,null,null,null,null,null,null,null,null,null,null,null,null,null,{"$f":"Accueil!V4","v":"Descriptif site"},{"$f":"Accueil!W4","v":1},{"$f":"Accueil!X4","v":0}]
[null,null,null,null,null,null,null,null,null,null,null,null,null,null,null,null,null,null,null,null,null,{"$f":"Accueil!V5","v":"Choix techniques"},{"$f":"Accueil!W5","v":1},{"$f":"Accueil!X5","v":0}]
[null,null,null,null,null,null,null,null,null,null,null,null,null,null,null,null,null,null,null,null,null,{"$f":"Accueil!V6","v":0},{"$f":"Accueil!W6","v":4},{"$f":"Accueil!X6","v":0}]
[null,null,null,null,null,null,null,null,null,null,null,null,null,null,null,null,null,null,null,null,null,{"$f":"Accueil!V7","v":"Evaluations faites"},{"$f":"Accueil!W7","v":4},{"$f":"Accueil!X7","v":0}]
[]
[]
[]
[null,null,null,null,null,null,null,null,null,null,null,null,null,null,null,null,null,null,null,null,null,null,"pollution récente"]
[null,null,null,null,null,null,null,null,null,null,null,null,null,null,null,null,null,null,null,null,null,null,"pollution historique"]
[]
[null,null,null,null,null,null,null,null,null,null,null,null,null,null,null,null,null,null,null,null,null,null,"patrimoine"]
[null,null,null,null,null,null,null,null,null,null,null,null,null,null,null,null,null,null,null,null,null,null,"non patrimoine"]
[]
[null,null,null,null,null,null,null,null,null,null,null,null,null,null,null,null,null,null,null,null,null,"oui","GRER",null,null,null,null,{"$f":"COUNTIF(AA20:AB28,TRUE)","v":3}]
[null,null,"A. Cas d'un projet de réaménagement (Art 64)",null,null,null,null,null,null,null,null,null,null,null,null,null,null,null,null,null,null,"non","GRPA"]
[null,null,null,null,null,null,null,null,null,null,null,null,null,null,null,null,null,null,null,null,null,"type I","Risque résiduel",null,null,null,"verification1","verification2"]
[null,null,null,"Le projet de réaménagement permet-il de supprimer l'entiereté de la pollution jusqu'aux VR?",null,null,null,null,null,null,null,"",null,null,null,null,"version","0.37",null,null,null,"type II","Art. 64",null,"choisissez une option",null,{"$f":"Y20=F20","v":false},{"$f":"F20=\"\"","v":true}]
[null,null,null,null,null,"","","","","",null,null,null,null,null,null,null,null,null,null,null,null,null,null,"","","",""]
[null,null,null,null,null,null,null,null,null,null,null,null,null,null,null,null,null,null,null,null,null,null,null,null,"choisissez une option",null,{"$f":"Y22=F22","v":false},{"$f":"F22=\"\"","v":true}]
[null,null,null,null,null,null,null,null,null,null,null,null,null,null,null,null,null,null,null,null,null,null,null,null,"","","",""]
[null,null,null,null,null,"","","","","",null,null,null,null,null,null,null,null,null,null,null,null,null,null,"","","",""]
[null,null,"B. Autres cas",null,null,"","","","","",null,null,null,null,null,null,null,null,null,null,null,null,null,null,"","","",""]
[null,null,null,null,null,null,null,null,null,null,null,null,null,null,null,null,null,null,null,null,null,null,null,null,"","","",""]
[null,null,null,"Votre assainissement consiste-t-il en une excavation totale?",null,null,null,null,null,null,null,"non",null,null,null,null,null,null,null,null,"x",null,null,null,"choisissez une option",null,{"$f":"Y27=F27","v":false},{"$f":"F27=\"\"","v":true}]
[null,null,null,null,null,null,null,null,null,null,null,null,null,null,null,null,null,null,null,null,null,null,null,null,"","","",""]
[null,null,null,"1. La volumétrie concernée par l’excavation totale est-elle supérieure à 600 m³ et 8 camions maximum par jour (40 camions sur une semaine)?",null,null,null,null,null,null,null,"n/a",null,null,null,null,null,null,null,null,"x",null,null,null,"texte libre",null,{"$f":"Y29=F29","v":false},{"$f":"F29=\"\"","v":true}]
[null,null,null,null,null,null,null,null,null,null,null,null,null,null,null,null,null,null,null,null,null,null,null,null,"","","",""]
[null,null,null,"2. L’excavation totale proposée se trouve-t-elle en affectation de type I (naturelle) ou zone de prévention de captage (type II)?",null,null,null,null,null,null,null,"n/a",null,null,null,null,null,null,null,null,"x",null,null,null,"texte libre",null,{"$f":"Y31=F31","v":false},{"$f":"F31=\"\"","v":true}]
[null,null,null,null,null,null,null,null,null,null,null,null,null,null,null,null,null,null,null,null,null,null,null,null,"","","",""]
[null,null,null,"3. L'excavation totale de la pollution implique-t-elle un rabattement de nappe ? ",null,null,null,null,null,null,null,"n/a",null,null,null,null,null,null,null,null,"x",null,null,null,"texte libre",null,{"$f":"Y33=F33","v":false},{"$f":"F33=\"\"","v":true}]
[null,null,null,null,null,null,null,null,null,null,null,null,null,null,null,null,null,null,null,null,null,null,null,null,"","","",""]
[null,null,null,"4. L’excavation totale implique-t-elle des mesures de sécurité post-assainissement ?",null,null,null,null,null,null,null,"n/a",null,null,null,null,null,null,null,null,"x",null,null,null,"date",null,{"$f":"Y35=F35","v":false},{"$f":"F35=\"\"","v":true}]
[null,null,null,null,null,null,null,null,null,null,null,null,null,null,null,null,null,null,null,null,null,null,null,null,"","","",""]
[null,null,null,"5. L’excavation totale proposée implique-t-elle la nécessité de détruire et reconstruire un bâtiment ou des impétrants?",null,null,null,null,null,null,null,"n/a",null,null,null,null,null,null,null,null,"x",null,null,null,"date",null,{"$f":"Y37=F37","v":false},{"$f":"F37=\"\"","v":true}]
[null,null,null,null,null,null,null,null,null,null,null,null,null,null,null,null,null,null,null,null,null,null,null,null,"","","",""]
[null,null,null,"6. L'excavation totale ou ses conséquences en terme de destruction, déviation, reconstruction de biens impliquent-elles des pertes de revenus (fermeture de commerces, impossibilité d'accès ou de passage, location interrompue, …) et/ou des dommages collatéraux aux personnes ou entreprises riveraines (évacuation de personnes physiques ou morales, coupures d'approvisionnement, relogement de personnes, délocalisation temporaire d'entreprises, …)?",null,null,null,null,null,null,null,"n/a",null,null,null,null,null,null,null,null,"x",null,null,null,"texte libre",null,{"$f":"Y39=F39","v":false},{"$f":"F39=\"\"","v":true}]
[null,null,null,null,null,null,null,null,null,null,null,null,null,null,null,null,null,null,null,null,null,null,null,null,"","","",""]
[null,null,null,"7.L’excavation totale provoque des dégâts sur le patrimoine immobilier, culturel ou naturel de la région (dégâts sur/ou destruction de bâtiments classés, impact sur/ ou destruction de(s) site(s) archéologique(s), de(s) site(s) naturel(s) protégé(s), …) ?",null,null,null,null,null,null,null,"n/a",null,null,null,null,null,null,null,null,"x",null,null,null,"texte libre",null,{"$f":"Y41=F41","v":false},{"$f":"F41=\"\"","v":true}]
[null,null,null,null,null,null,null,null,null,null,null,"",null,null,null,null,null,null,null,null,null,null,null,null,"","","",""]
[null,null,null,null,null,null,null,null,null,null,null,""]
[null,null,null,null,null,null,null,null,null,null,null,""]
[null,null,null,null,null,null,null,null,null,null,null,""]
[null,null,null,null,null,null,null,null,null,null,{"$f":"COUNTIF(L29:L41, \"oui\")+COUNTIF(L29:L41,\"non\")","v":0},{"$f":"IF(COUNTIF(L29:L41,\"oui\")>0, \"oui\", \"non\")","v":"non"}]

{"sheet":"Accueil","index":1,"n_rows":78,"n_cols":28,"rows_kept":78,"cut":false,"hidden":false,"merged":[[65,5,67,12],[68,5,70,12],[71,5,73,12],[74,5,76,12],[77,5,79,12],[65,3,67,4],[68,3,70,4],[71,3,73,4],[74,3,76,4],[77,3,79,4],[44,3,46,4],[47,3,49,4],[50,3,52,4],[62,3,64,4],[62,5,64,12],[50,5,52,12],[47,5,49,12],[44,5,46,12],[53,3,55,4],[53,5,55,12],[56,3,58,4],[56,5,58,12],[59,3,61,4],[59,5,61,12],[41,3,43,4],[41,5,43,12],[19,5,19,9],[21,5,21,9],[23,5,23,9],[28,5,28,9],[30,5,30,9],[32,5,32,9],[34,5,34,9],[36,5,36,9]]}
[]
[null,null,null,null,null,null,null,null,null,null,null,null,null,null,null,null,null,null,null,null,null,"Choix variantes",{"$f":"Scenarios!X3","v":1}]
[null,null,null,null,null,null,null,null,null,null,null,null,null,null,null,null,null,null,null,null,null,"Acuueil",{"$f":"IF(AB17=0,0,1)","v":1}]
[null,null,null,null,null,null,null,null,null,null,null,null,null,null,null,null,null,null,null,null,null,"Descriptif site",{"$f":"'Descriptif site'!Z4","v":1}]
[null,null,null,null,null,null,null,null,null,null,null,null,null,null,null,null,null,null,null,null,null,"Choix techniques",{"$f":"Scenarios!X6","v":1}]
[null,null,null,null,null,null,null,null,null,null,null,null,null,null,null,null,null,null,null,null,null,null,{"$f":"SUM(W2:W5)","v":4}]
[null,null,null,null,null,null,null,null,null,null,null,null,null,null,null,null,null,null,null,null,null,"Evaluations faites",{"$f":"W6+X7","v":4},{"$f":"Eval_cout!T18+Eval_soc!T18+Eval_env!T18","v":0}]
[]
[]
[]
[null,null,null,null,null,null,null,null,null,null,null,null,null,null,null,null,null,null,null,null,null,null,"pollution nouvelle"]
[null,null,null,null,null,null,null,null,null,null,null,null,null,null,null,null,null,null,null,null,null,null,"pollution historique"]
[]
[null,null,null,null,null,null,null,null,null,null,null,null,null,null,null,null,null,null,null,null,null,null,"patrimoine"]
[null,null,null,null,null,null,null,null,null,null,null,null,null,null,null,null,null,null,null,null,null,null,"non patrimoine"]
[]
[null,null,null,null,null,null,null,null,null,null,null,null,null,null,null,null,null,null,null,null,null,null,"ER",null,null,null,null,{"$f":"COUNTIF(AA37:AB37,TRUE)+COUNTIF(AA20:AB29,TRUE)","v":5}]
[null,null,"Données du projet",null,null,null,null,null,null,null,null,null,null,null,null,null,null,null,null,null,null,null,"PA"]
[null,null,null,null,null,null,null,null,null,null,null,null,null,null,null,null,null,null,null,null,null,null,"EF",null,null,null,"verification1","verification2"]
[null,null,null,"Type de pollution*",null,"choisissez une option",null,null,null,null,null,null,null,null,null,null,null,null,null,null,null,null,"Art. 64",null,"choisissez une option",null,{"$f":"Y20=F20","v":true},{"$f":"F20=\"\"","v":false}]
[null,null,null,null,null,"","","","","",null,null,null,null,null,null,null,null,null,null,null,null,null,null,"","","",""]
[null,null,null,"Patrimoine*",null,"choisissez une option",null,null,null,null,null,null,null,null,null,null,null,null,null,null,null,null,null,null,"choisissez une option",null,{"$f":"Y22=F22","v":true},{"$f":"F22=\"\"","v":false}]
[null,null,null,null,null,"","","","","",null,null,null,null,null,null,null,null,null,null,null,null,null,null,"","","",""]
[null,null,null,"Cadre légal*",null,"choisissez une option",null,null,null,null,null,null,null,null,null,null,null,null,null,null,null,null,null,null,"choisissez une option",null,{"$f":"Y24=F24","v":true},{"$f":"F24=\"\"","v":false}]
[null,null,null,null,null,"","","","","",null,null,null,null,null,null,null,null,null,null,null,null,null,null,"","","",""]
[null,null,null,null,null,"","","","","",null,null,null,null,null,null,null,null,null,null,null,null,null,null,"","","",""]
[null,null,"Données administratives",null,null,"","","","","",null,null,null,null,null,null,null,null,null,null,null,null,null,null,"","","",""]
[null,null,null,null,null,"","","","","",null,null,null,null,null,null,null,null,null,null,null,null,null,null,"","","",""]
[null,null,null,"Site*",null,"texte libre",null,null,null,null,null,null,null,null,null,null,null,null,null,null,null,null,null,null,"texte libre",null,{"$f":"Y29=F29","v":true},{"$f":"F29=\"\"","v":false}]
[null,null,null,null,null,"","","","","",null,null,null,null,null,null,null,null,null,null,null,null,null,null,"","","",""]
[null,null,null,"Adresse",null,"texte libre",null,null,null,null,null,null,null,null,null,null,null,null,null,null,null,null,null,null,"texte libre",null,{"$f":"Y31=F31","v":true},{"$f":"F31=\"\"","v":false}]
[null,null,null,null,null,"","","","","",null,null,null,null,null,null,null,null,null,null,null,null,null,null,"","","",""]
[null,null,null,"Expert",null,"texte libre",null,null,null,null,null,null,null,null,null,null,null,null,null,null,null,null,null,null,"texte libre",null,{"$f":"Y33=F33","v":true},{"$f":"F33=\"\"","v":false}]
[null,null,null,null,null,"","","","","",null,null,null,null,null,null,null,null,null,null,null,null,null,null,"","","",""]
[null,null,null,"Date Evaluation",null,"date",null,null,null,null,null,null,null,null,null,null,null,null,null,null,null,null,null,null,"date",null,{"$f":"Y35=F35","v":true},{"$f":"F35=\"\"","v":false}]
[null,null,null,null,null,"","","","","",null,null,null,null,null,null,null,null,null,null,null,null,null,null,"","","",""]
[null,null,null,"Numéro de dossier*",null,"texte libre",null,null,null,null,null,null,null,null,null,null,null,null,null,null,null,null,null,null,"texte libre",null,{"$f":"Y37=F37","v":true},{"$f":"F37=\"\"","v":false}]
[]
[]
[null,null,"Descriptif des pages de l'outil"]
[]
[null,null,null,"Intro",null,"L'onglet Intro permet de déterminer si l'utilisation de GAMMA est nécessaire."]
[]
[]
[null,null,null,"Accueil",null,"L'onglet Accueil permet de préciser les données spécifiques liées au projet d'assainissement."]
[]
[]
[null,null,null,"Descriptif site",null,"L'onglet \"Descriptif site\" permet de décrire les caractéristiques spécifiques liées au site investigué."]
[]
[]
[null,null,null,"Techniques HS",null,"L'utilisateur présélectionne les techniques HS pertinentes dans une liste prédéfinie mise à jour"]
[]
[]
[null,null,null,"Techniques OS",null,"L'utilisateur présélectionne les techniques OS pertinentes dans une liste prédéfinie mise à jour"]
[]
[]
[null,null,null,"Techniques IS",null,"L'utilisateur présélectionne les techniques IS pertinentes dans une liste prédéfinie mise à jour"]
[]
[]
[null,null,null,"Techniques E",null,"L'utilisateur présélectionne les techniques E pertinentes dans une liste prédéfinie mise à jour"]
[]
[]
[null,null,null,"Choix des variantes",null,"L'utilisateur décrit les combinaisons de techniques présélectionnées qu'il souhaite investiguer."]
[]
[]
[null,null,null,"Evaluation coût",null,"L'utilisateur rentre l'ensemble des évaluations des variantes liées aux aspects économiques."]
[]
[]
[null,null,null,"Evaluation environnementale",null,"L'utilisateur rentre l'ensemble des évaluations des variantes liées aux aspects environnementaux."]
[]
[]
[null,null,null,"Evaluation sociale",null,"L'utilisateur rentre l'ensemble des évaluations des variantes liées aux aspects sociaux."]
[]
[]
[null,null,null,"Evaluation resumé",null,"Présentation de l'ensemble des évaluations précédemment réalisées par l'utilisateur."]
[]
[]
[null,null,null,"Résultats",null,"Classement final des variantes."]

{"sheet":"Descriptif site","index":2,"n_rows":39,"n_cols":42,"rows_kept":39,"cut":false,"hidden":false,"merged":[[24,16,25,19],[24,15,25,15],[28,3,28,7],[26,3,26,7],[26,9,26,13],[28,9,28,13],[30,9,30,13],[30,3,30,7],[11,15,11,18],[12,15,12,18],[13,15,13,18],[14,15,14,18],[15,15,15,18],[16,15,16,18],[24,3,24,7],[22,3,22,7],[18,3,18,7],[20,3,21,7],[18,9,18,13],[20,9,20,13],[22,9,22,13],[24,9,24,13]]}
[null,null,null,null,null,null,null,null,null,null,null,null,null,null,null,null,null,null,null,null,null,null,"Nom Technique 6","Nom Technique 9","Nom Technique 10","Nom Technique 11","Nom Technique 12","Nom Technique 16","Nom Technique 17","Nom Technique 19","Nom Technique 20","n/a","Nom Technique 20","Nom Technique 20","Nom Technique 20","Nom Technique 20","Nom Technique 20","Nom Technique 20","Nom Technique 20","Nom Technique 20","Nom Technique 20","Nom Technique 20"]
[null,null,null,null,null,null,null,null,null,null,null,null,null,null,null,null,null,null,null,null,null,null,null,null,"Variantes",{"$f":"Scenarios!X3","v":1}]
[null,null,null,null,null,null,null,null,null,null,null,null,null,null,null,null,null,null,null,null,null,null,null,null,"Acuueil",{"$f":"Accueil!W3","v":1}]
[null,null,null,null,null,null,null,null,null,null,null,null,null,null,null,null,null,null,null,null,null,null,"vérification",null,"Descriptif site",{"$f":"IF(W5=0,0,1)","v":1}]
[null,null,null,null,null,null,null,null,null,null,null,null,null,null,null,null,null,null,null,null,null,null,{"$f":"COUNTIF(Y19:Z29,TRUE)","v":6},null,"Choix techniques",{"$f":"Scenarios!X6","v":1}]
[null,null,null,null,null,null,null,null,null,null,null,null,null,null,null,null,null,null,null,null,null,null,null,null,null,{"$f":"SUM(Z2:Z5)","v":4}]
[null,null,null,null,null,null,null,null,null,null,null,null,null,null,null,null,null,null,null,null,null,null,null,null,null,{"$f":"Accueil!X7","v":0}]
[]
[]
[]
[]
[null,null,null,null,null,null,null,null,null,null,null,null,null,null,null,null,null,null,null,null,null,null,"oui"]
[null,null,null,null,null,null,null,null,null,null,null,null,null,null,null,null,null,null,null,null,null,null,"non"]
[]
[]
[null,null,null,null,false,null,null,null,null,null,null,null,null,null,null,null,null,null,null,null,null,null,"urbain"]
[null,null,null,null,null,null,null,null,null,null,null,null,null,null,null,null,null,null,null,null,null,null,"périurbain / rural"]
[null,null,null,null,null,null,null,null,null,null,null,null,null,null,null,null,null,null,null,null,null,null,"industriel",null,"v"]
[null,null,null,"Type de média*",null,null,null,null,null,"texte libre",null,null,null,null,null,null,null,null,null,null,null,null,null,"texte libre",{"$f":"X19=J19","v":true},{"$f":"J19=\"\"","v":false}]
[]
[null,null,null,"Type de polluant*",null,null,null,null,null,"texte libre",null,null,null,null,null,null,null,null,null,null,null,null,"zone nature","texte libre",{"$f":"X21=J21","v":true},{"$f":"J21=\"\"","v":false}]
[null,null,null,null,null,null,null,null,null,null,null,null,null,null,null,null,null,null,null,null,null,null,"hors zone nature"]
[null,null,null,"Nombre de pollution*",null,null,null,null,null,"nombre entier > 0",null,null,null,null,null,null,null,null,null,null,null,null,null,"nombre entier > 0",{"$f":"X23=J23","v":true},{"$f":"J23=\"\"","v":false}]
[]
[null,null,null,"Si vos pollutions sont du même type de polluant et du même type de média, avez-vous réalisé une évaluation globale?*",null,null,null,null,null,"choisissez une option",null,null,null,null,null,"Justification: (limite de 300 caractères)","texte libre",null,null,null,null,null,null,"choisissez une option",{"$f":"X25=J25","v":true},{"$f":"J25=\"\"","v":false}]
[]
[null,null,null,"Choix 1*",null,null,null,null,null,"choisissez une option",null,null,null,null,null,null,null,null,null,null,null,null,null,"choisissez une option",{"$f":"X27=J27","v":true},{"$f":"J27=\"\"","v":false}]
[]
[null,null,null,"Choix 2*",null,null,null,null,null,"choisissez une option",null,null,null,null,null,null,null,null,null,null,null,null,null,"choisissez une option",{"$f":"X29=J29","v":true},{"$f":"J29=\"\"","v":false}]
[]
[null,null,null,"Cette évaluation s'applique à (limite de 300 caractères)",null,null,null,null,null,"texte libre",null,null,null,null,null,null,null,null,null,null,null,null,null,"texte libre"]
[]
[]
[]
[]
[]
[]
[null,null,null,"Activé"]
[null,null,null,"Désactivé"]

{"sheet":"TechniquesHS","index":3,"n_rows":1056,"n_cols":42,"rows_kept":1056,"cut":false,"hidden":false,"merged":[[11,15,11,18],[16,15,16,18],[19,6,19,7],[21,6,21,7],[21,9,21,13],[21,15,21,19],[12,16,12,18],[23,6,23,7],[23,9,23,13],[23,15,23,19],[24,6,24,7],[24,9,24,13],[24,15,24,19],[22,6,22,7],[22,9,22,13],[22,15,22,19],[27,6,27,7],[27,9,27,13],[27,15,27,19],[25,6,25,7],[25,9,25,13],[25,15,25,19],[26,6,26,7],[26,9,26,13],[26,15,26,19],[30,6,30,7],[30,9,30,13],[30,15,30,19],[31,6,31,7],[31,9,31,13],[31,15,31,19],[28,6,28,7],[28,9,28,13],[28,15,28,19],[29,6,29,7],[29,9,29,13],[29,15,29,19],[35,6,35,7],[35,9,35,13],[35,15,35,19],[32,6,32,7],[32,9,32,13],[32,15,32,19],[33,6,33,7],[33,9,33,13],[33,15,33,19],[34,6,34,7],[34,9,34,13],[34,15,34,19],[38,6,38,7],[38,9,38,13],[38,15,38,19],[39,6,39,7],[39,9,39,13],[39,15,39,19],[36,6,36,7],[36,9,36,13],[36,15,36,19],[37,6,37,7],[37,9,37,13],[37,15,37,19],[42,6,42,7],[42,9,42,13],[42,15,42,19],[43,6,43,7],[43,9,43,13],[43,15,43,19],[40,6,40,7],[40,9,40,13],[40,15,40,19],[41,6,41,7],[41,9,41,13],[41,15,41,19],[46,6,46,7],[46,9,46,13],[46,15,46,19],[47,6,47,7],[47,9,47,13],[47,15,47,19],[44,6,44,7],[44,9,44,13],[44,15,44,19],[45,6,45,7],[45,9,45,13],[45,15,45,19],[50,6,50,7],[50,9,50,13],[50,15,50,19],[51,6,51,7],[51,9,51,13],[51,15,51,19],[48,6,48,7],[48,9,48,13],[48,15,48,19],[49,6,49,7],[49,9,49,13],[49,15,49,19],[54,6,54,7],[54,9,54,13],[54,15,54,19],[55,6,55,7],[55,9,55,13],[55,15,55,19],[52,6,52,7],[52,9,52,13],[52,15,52,19],[53,6,53,7],[53,9,53,13],[53,15,53,19],[58,6,58,7],[58,9,58,13],[58,15,58,19],[59,6,59,7],[59,9,59,13],[59,15,59,19],[56,6,56,7],[56,9,56,13],[56,15,56,19],[57,6,57,7],[57,9,57,13],[57,15,57,19],[62,15,62,19],[63,6,63,7],[63,9,63,13],[63,15,63,19],[60,6,60,7],[60,9,60,13],[60,15,60,19],[61,6,61,7],[61,9,61,13],[61,15,61,19],[70,6,70,7],[70,9,70,13],[70,15,70,19],[13,16,13,18],[68,6,68,7],[68,9,68,13],[68,15,68,19],[69,6,69,7],[69,9,69,13],[69,15,69,19],[66,6,66,7],[66,9,66,13],[66,15,66,19],[67,6,67,7],[67,9,67,13],[67,15,67,19],[64,6,64,7],[64,9,64,13],[64,15,64,19],[65,6,65,7],[65,9,65,13],[65,15,65,19],[62,6,62,7],[62,9,62,13]]}
[]
[null,null,null,null,null,null,null,null,null,null,null,null,null,null,null,null,null,null,null,null,null,null,"Erreurs 1ers onglets:"]
[null,null,null,null,null,null,null,null,null,null,null,null,null,null,null,null,null,null,null,null,null,null,"Variante",{"$f":"Scenarios!X3","v":1}]
[null,null,null,null,null,null,null,null,null,null,null,null,null,null,null,null,null,null,null,null,null,null,"Acuueil",{"$f":"Accueil!W3","v":1}]
[null,null,null,null,null,null,null,null,null,null,null,null,null,null,null,null,null,null,null,null,null,null,"Descriptif site",{"$f":"'Descriptif site'!Z4","v":1}]
[null,null,null,null,null,null,null,null,null,null,null,null,null,null,null,null,null,null,null,null,null,null,"Choix techniques",{"$f":"TechniquesIS!$Z$20+TechniquesOS!$Z$20+TechniquesHS!Z20+TechniquesE!Z20","v":0},"Erreurs évaluations:"]
[null,null,null,null,null,null,null,null,null,null,null,null,null,null,null,null,null,null,null,null,null,null,null,{"$f":"SUM(X3:X6)","v":3},{"$f":"Accueil!X7","v":0}]
[]
[]
[]
[]
[]
[null,null,null,null,null,null,null,null,null,null,null,null,null,null,null,null,"Nombre de techniques à considérer:"]
[null,null,null,null,null,null,null,null,null,null,null,null,null,null,null,null,7]
[]
[null,null,null,null,false]
[]
[]
[null,null,null,null,null,null,null,null,null,null,null,null,null,null,null,null,null,null,null,null,null,null,null,null,{"$f":"IF(OR(Y20>10,Y20<2),1,0)","v":0}]
[null,null,null,"N°","Technique activée?",null,"Nom de la technique",null,null,"Description de la technique",null,null,null,null,null,"Justification",null,null,null,null,null,null,null,null,{"$f":"COUNTIF(Y22:Y28,TRUE)","v":7},{"$f":"COUNTIF(Z22:Z72,\"non completé\")","v":0}]
[null,null,null,null,null,null,null,null,null,null,null,null,null,null,null,null,null,null,null,null,null,null,null,null,null,null,null,null,null,null,null,null,null,null,null,null,null,null,null,null,null,0]
[null,null,null,"Technique 1",null,null,"HS1",null,null,"Excavation et incinération",null,null,null,null,null,null,null,null,null,null,null,null,null,null,true,{"$f":"IF(AND(Y22=FALSE,P22=\"\"),\"non completé\", \"ok\")","v":"ok"}]
[null,null,null,"Technique 2",null,null,"HS2",null,null,"Excavation et traitement thermique",null,null,null,null,null,null,null,null,null,null,null,null,null,null,true,{"$f":"IF(AND(Y23=FALSE,P23=\"\"),\"non completé\", \"ok\")","v":"ok"}]
[null,null,null,"Technique 3",null,null,"HS3",null,null,"Excavation et traitement physico-chimique",null,null,null,null,null,null,null,null,null,null,null,null,null,null,true,"ok"]
[null,null,null,"Technique 4",null,null,"HS4",null,null,"Excavation et traitement biologique",null,null,null,null,null,null,null,null,null,null,null,null,null,null,true,"ok"]
[null,null,null,"Technique 5",null,null,"HS5",null,null,"Excavation et mise en décharge",null,null,null,null,null,null,null,null,null,null,null,null,null,null,true,"ok"]
[null,null,null,"Technique 6",null,null,"HS6",null,null,"Excavation et réutilisation",null,null,null,null,null,null,null,null,null,null,null,null,null,null,true,"ok"]
[null,null,null,"Technique 7",null,null,"HS7",null,null,"Excavation et pyrolyse",null,null,null,null,null,null,null,null,null,null,null,null,null,null,true,"ok"]
[null,null,null,"Technique 8",null,null,"HS8",null,null,"Donnez une description…",null,null,null,null,null,null,null,null,null,null,null,null,null,null,true,"ok"]
[null,null,null,"Technique 9",null,null,"HS9",null,null,"Donnez une description…",null,null,null,null,null,null,null,null,null,null,null,null,null,null,true,"ok"]
[null,null,null,"Technique 10",null,null,"HS10",null,null,"Donnez une description…",null,null,null,null,null,null,null,null,null,null,null,null,null,null,true,"ok"]
[null,null,null,"Technique 11",null,null,"HS11",null,null,"Donnez une description…",null,null,null,null,null,null,null,null,null,null,null,null,null,null,true,"ok"]
[null,null,null,"Technique 12",null,null,"HS12",null,null,"Donnez une description…",null,null,null,null,null,null,null,null,null,null,null,null,null,null,true,"ok"]
[null,null,null,"Technique 13",null,null,"HS13",null,null,"Donnez une description…",null,null,null,null,null,null,null,null,null,null,null,null,null,null,true,{"$f":"IF(AND(Y34=FALSE,P34=\"\"),\"non completé\", \"ok\")","v":"ok"}]
[null,null,null,"Technique 14",null,null,"HS14",null,null,"Donnez une description…",null,null,null,null,null,null,null,null,null,null,null,null,null,null,true,{"$f":"IF(AND(Y35=FALSE,P35=\"\"),\"non completé\", \"ok\")","v":"ok"}]
[null,null,null,"Technique 15",null,null,"HS15",null,null,"Donnez une description…",null,null,null,null,null,null,null,null,null,null,null,null,null,null,true,{"$f":"IF(AND(Y36=FALSE,P36=\"\"),\"non completé\", \"ok\")","v":"ok"}]
[null,null,null,"Technique 16",null,null,"HS16",null,null,"Donnez une description…",null,null,null,null,null,null,null,null,null,null,null,null,null,null,true,{"$f":"IF(AND(Y37=FALSE,P37=\"\"),\"non completé\", \"ok\")","v":"ok"}]
[null,null,null,"Technique 17",null,null,"HS17",null,null,"Donnez une description…",null,null,null,null,null,null,null,null,null,null,null,null,null,null,true,{"$f":"IF(AND(Y38=FALSE,P38=\"\"),\"non completé\", \"ok\")","v":"ok"}]
[null,null,null,"Technique 18",null,null,"HS18",null,null,"Donnez une description…",null,null,null,null,null,null,null,null,null,null,null,null,null,null,true,{"$f":"IF(AND(Y39=FALSE,P39=\"\"),\"non completé\", \"ok\")","v":"ok"}]
[null,null,null,"Technique 19",null,null,"HS19",null,null,"Donnez une description…",null,null,null,null,null,null,null,null,null,null,null,null,null,null,true,{"$f":"IF(AND(Y40=FALSE,P40=\"\"),\"non completé\", \"ok\")","v":"ok"}]
[null,null,null,"Technique 20",null,null,"HS20",null,null,"Donnez une description…",null,null,null,null,null,null,null,null,null,null,null,null,null,null,true,{"$f":"IF(AND(Y41=FALSE,P41=\"\"),\"non completé\", \"ok\")","v":"ok"}]
[null,null,null,"Technique 21",null,null,"HS21",null,null,"Donnez une description…",null,null,null,null,null,null,null,null,null,null,null,null,null,null,true,{"$f":"IF(AND(Y42=FALSE,P42=\"\"),\"non completé\", \"ok\")","v":"ok"}]
[null,null,null,"Technique 22",null,null,"HS22",null,null,"Donnez une description…",null,null,null,null,null,null,null,null,null,null,null,null,null,null,true,{"$f":"IF(AND(Y43=FALSE,P43=\"\"),\"non completé\", \"ok\")","v":"ok"}]
[null,null,null,"Technique 23",null,null,"HS23",null,null,"Donnez une description…",null,null,null,null,null,null,null,null,null,null,null,null,null,null,true,{"$f":"IF(AND(Y44=FALSE,P44=\"\"),\"non completé\", \"ok\")","v":"ok"}]
[null,null,null,"Technique 24",null,null,"HS24",null,null,"Donnez une description…",null,null,null,null,null,null,null,null,null,null,null,null,null,null,true,{"$f":"IF(AND(Y45=FALSE,P45=\"\"),\"non completé\", \"ok\")","v":"ok"}]
[null,null,null,"Technique 25",null,null,"HS25",null,null,"Donnez une description…",null,null,null,null,null,null,null,null,null,null,null,null,null,null,true,{"$f":"IF(AND(Y46=FALSE,P46=\"\"),\"non completé\", \"ok\")","v":"ok"}]
[null,null,null,"Technique 26",null,null,"HS26",null,null,"Donnez une description…",null,null,null,null,null,null,null,null,null,null,null,null,null,null,true,{"$f":"IF(AND(Y47=FALSE,P47=\"\"),\"non completé\", \"ok\")","v":"ok"}]
[null,null,null,"Technique 27",null,null,"HS27",null,null,"Donnez une description…",null,null,null,null,null,null,null,null,null,null,null,null,null,null,true,{"$f":"IF(AND(Y48=FALSE,P48=\"\"),\"non completé\", \"ok\")","v":"ok"}]
[null,null,null,"Technique 28",null,null,"HS28",null,null,"Donnez une description…",null,null,null,null,null,null,null,null,null,null,null,null,null,null,true,{"$f":"IF(AND(Y49=FALSE,P49=\"\"),\"non completé\", \"ok\")","v":"ok"}]
[null,null,null,"Technique 29",null,null,"HS29",null,null,"Donnez une description…",null,null,null,null,null,null,null,null,null,null,null,null,null,null,true,{"$f":"IF(AND(Y50=FALSE,P50=\"\"),\"non completé\", \"ok\")","v":"ok"}]
[null,null,null,"Technique 30",null,null,"HS30",null,null,"Donnez une description…",null,null,null,null,null,null,null,null,null,null,null,null,null,null,true,{"$f":"IF(AND(Y51=FALSE,P51=\"\"),\"non completé\", \"ok\")","v":"ok"}]
[null,null,null,"Technique 31",null,null,"HS31",null,null,"Donnez une description…",null,null,null,null,null,null,null,null,null,null,null,null,null,null,true,{"$f":"IF(AND(Y52=FALSE,P52=\"\"),\"non completé\", \"ok\")","v":"ok"}]
[null,null,null,"Technique 32",null,null,"HS32",null,null,"Donnez une description…",null,null,null,null,null,null,null,null,null,null,null,null,null,null,true,{"$f":"IF(AND(Y53=FALSE,P53=\"\"),\"non completé\", \"ok\")","v":"ok"}]
[null,null,null,"Technique 33",null,null,"HS33",null,null,"Donnez une description…",null,null,null,null,null,null,null,null,null,null,null,null,null,null,true,{"$f":"IF(AND(Y54=FALSE,P54=\"\"),\"non completé\", \"ok\")","v":"ok"}]
[null,null,null,"Technique 34",null,null,"HS34",null,null,"Donnez une description…",null,null,null,null,null,null,null,null,null,null,null,null,null,null,true,{"$f":"IF(AND(Y55=FALSE,P55=\"\"),\"non completé\", \"ok\")","v":"ok"}]
[null,null,null,"Technique 35",null,null,"HS35",null,null,"Donnez une description…",null,null,null,null,null,null,null,null,null,null,null,null,null,null,true,{"$f":"IF(AND(Y56=FALSE,P56=\"\"),\"non completé\", \"ok\")","v":"ok"}]
[null,null,null,"Technique 36",null,null,"HS36",null,null,"Donnez une description…",null,null,null,null,null,null,null,null,null,null,null,null,null,null,true,{"$f":"IF(AND(Y57=FALSE,P57=\"\"),\"non completé\", \"ok\")","v":"ok"}]
[null,null,null,"Technique 37",null,null,"HS37",null,null,"Donnez une description…",null,null,null,null,null,null,null,null,null,null,null,null,null,null,true,{"$f":"IF(AND(Y58=FALSE,P58=\"\"),\"non completé\", \"ok\")","v":"ok"}]
[null,null,null,"Technique 38",null,null,"HS38",null,null,"Donnez une description…",null,null,null,null,null,null,null,null,null,null,null,null,null,null,true,{"$f":"IF(AND(Y59=FALSE,P59=\"\"),\"non completé\", \"ok\")","v":"ok"}]
[null,null,null,"Technique 39",null,null,"HS39",null,null,"Donnez une description…",null,null,null,null,null,null,null,null,null,null,null,null,null,null,true,{"$f":"IF(AND(Y60=FALSE,P60=\"\"),\"non completé\", \"ok\")","v":"ok"}]
[null,null,null,"Technique 40",null,null,"HS40",null,null,"Donnez une description…",null,null,null,null,null,null,null,null,null,null,null,null,null,null,true,{"$f":"IF(AND(Y61=FALSE,P61=\"\"),\"non completé\", \"ok\")","v":"ok"}]
[null,null,null,"Technique 41",null,null,"HS41",null,null,"Donnez une description…",null,null,null,null,null,null,null,null,null,null,null,null,null,null,true,{"$f":"IF(AND(Y62=FALSE,P62=\"\"),\"non completé\", \"ok\")","v":"ok"}]
[null,null,null,"Technique 42",null,null,"HS42",null,null,"Donnez une description…",null,null,null,null,null,null,null,null,null,null,null,null,null,null,true,{"$f":"IF(AND(Y63=FALSE,P63=\"\"),\"non completé\", \"ok\")","v":"ok"}]
[null,null,null,"Technique 43",null,null,"HS43",null,null,"Donnez une description…",null,null,null,null,null,null,null,null,null,null,null,null,null,null,true,{"$f":"IF(AND(Y64=FALSE,P64=\"\"),\"non completé\", \"ok\")","v":"ok"}]
[null,null,null,"Technique 44",null,null,"HS44",null,null,"Donnez une description…",null,null,null,null,null,null,null,null,null,null,null,null,null,null,true,{"$f":"IF(AND(Y65=FALSE,P65=\"\"),\"non completé\", \"ok\")","v":"ok"}]
[null,null,null,"Technique 45",null,null,"HS45",null,null,"Donnez une description…",null,null,null,null,null,null,null,null,null,null,null,null,null,null,true,{"$f":"IF(AND(Y66=FALSE,P66=\"\"),\"non completé\", \"ok\")","v":"ok"}]
[null,null,null,"Technique 46",null,null,"HS46",null,null,"Donnez une description…",null,null,null,null,null,null,null,null,null,null,null,null,null,null,true,{"$f":"IF(AND(Y67=FALSE,P67=\"\"),\"non completé\", \"ok\")","v":"ok"}]
[null,null,null,"Technique 47",null,null,"HS47",null,null,"Donnez une description…",null,null,null,null,null,null,null,null,null,null,null,null,null,null,true,{"$f":"IF(AND(Y68=FALSE,P68=\"\"),\"non completé\", \"ok\")","v":"ok"}]
[null,null,null,"Technique 48",null,null,"HS48",null,null,"Donnez une description…",null,null,null,null,null,null,null,null,null,null,null,null,null,null,true,{"$f":"IF(AND(Y69=FALSE,P69=\"\"),\"non completé\", \"ok\")","v":"ok"}]
[null,null,null,"Technique 49",null,null,"HS49",null,null,"Donnez une description…",null,null,null,null,null,null,null,null,null,null,null,null,null,null,true,{"$f":"IF(AND(Y70=FALSE,P70=\"\"),\"non completé\", \"ok\")","v":"ok"}]
[null,null,null,"Technique 50",null,null,"HS50",null,null,"Donnez une description…",null,null,null,null,null,null,null,null,null,null,null,null,null,null,true,{"$f":"IF(AND(Y71=FALSE,P71=\"\"),\"non completé\", \"ok\")","v":"ok"}]
[]
[]
[]
[]
[]
[]
[]
[]
[]
[]
[]
[]
[]
[]
[]
[]
[]
[]
[]
[]
[]
[]
[]
[]
[]
[]
[]
[]
[]
[]
[]
[]
[]
[]
[]
[]
[]
[]
[]
[]
[]
[]
[]
[]
[]
[]
[]
[]
[]
[]
[]
[]
[]
[]
[]
[]
[]
[]
[]
[]
[]
[]
[]
[]
[]
[]
[]
[]
[]
[]
[]
[]
[]
[]
[]
[]
[]
[]
[]
[]
[]
[]
[]
[]
[]
[]
[]
[]
[]
[]
[]
[]
[]
[]
[]
[]
[]
[]
[]
[]
[]
[]
[]
[]
[]
[]
[]
[]
[]
[]
[]
[]
[]
[]
[]
[]
[]
[]
[]
[]
[]
[]
[]
[]
[]
[]
[]
[]
[]
[]
[]
[]
[]
[]
[]
[]
[]
[]
[]
[]
[]
[]
[]
[]
[]
[]
[]
[]
[]
[]
[]
[]
[]
[]
[]
[]
[]
[]
[]
[]
[]
[]
[]
[]
[]
[]
[]
[]
[]
[]
[]
[]
[]
[]
[]
[]
[]
[]
[]
[]
[]
[]
[]
[]
[]
[]
[]
[]
[]
[]
[]
[]
[]
[]
[]
[]
[]
[]
[]
[]
[]
[]
[]
[]
[]
[]
[]
[]
[]
[]
[]
[]
[]
[]
[]
[]
[]
[]
[]
[]
[]
[]
[]
[]
[]
[]
[]
[]
[]
[]
[]
[]
[]
[]
[]
[]
[]
[]
[]
[]
[]
[]
[]
[]
[]
[]
[]
[]
[]
[]
[]
[]
[]
[]
[]
[]
[]
[]
[]
[]
[]
[]
[]
[]
[]
[]
[]
[]
[]
[]
[]
[]
[]
[]
[]
[]
[]
[]
[]
[]
[]
[]
[]
[]
[]
[]
[]
[]
[]
[]
[]
[]
[]
[]
[]
[]
[]
[]
[]
[]
[]
[]
[]
[]
[]
[]
[]
[]
[]
[]
[]
[]
[]
[]
[]
[]
[]
[]
[]
[]
[]
[]
[]
[]
[]
[]
[]
[]
[]
[]
[]
[]
[]
[]
[]
[]
[]
[]
[]
[]
[]
[]
[]
[]
[]
[]
[]
[]
[]
[]
[]
[]
[]
[]
[]
[]
[]
[]
[]
[]
[]
[]
[]
[]
[]
[]
[]
[]
[]
[]
[]
[]
[]
[]
[]
[]
[]
[]
[]
[]
[]
[]
[]
[]
[]
[]
[]
[]
[]
[]
[]
[]
[]
[]
[]
[]
[]
[]
[]
[]
[]
[]
[]
[]
[]
[]
[]
[]
[]
[]
[]
[]
[]
[]
[]
[]
[]
[]
[]
[]
[]
[]
[]
[]
[]
[]
[]
[]
[]
[]
[]
[]
[]
[]
[]
[]
[]
[]
[]
[]
[]
[]
[]
[]
[]
[]
[]
[]
[]
[]
[]
[]
[]
[]
[]
[]
[]
[]
[]
[]
[]
[]
[]
[]
[]
[]
[]
[]
[]
[]
[]
[]
[]
[]
[]
[]
[]
[]
[]
[]
[]
[]
[]
[]
[]
[]
[]
[]
[]
[]
[]
[]
[]
[]
[]
[]
[]
[]
[]
[]
[]
[]
[]
[]
[]
[]
[]
[]
[]
[]
[]
[]
[]
[]
[]
[]
[]
[]
[]
[]
[]
[]
[]
[]
[]
[]
[]
[]
[]
[]
[]
[]
[]
[]
[]
[]
[]
[]
[]
[]
[]
[]
[]
[]
[]
[]
[]
[]
[]
[]
[]
[]
[]
[]
[]
[]
[]
[]
[]
[]
[]
[]
[]
[]
[]
[]
[]
[]
[]
[]
[]
[]
[]
[]
[]
[]
[]
[]
[]
[]
[]
[]
[]
[]
[]
[]
[]
[]
[]
[]
[]
[]
[]
[]
[]
[]
[]
[]
[]
[]
[]
[]
[]
[]
[]
[]
[]
[]
[]
[]
[]
[]
[]
[]
[]
[]
[]
[]
[]
[]
[]
[]
[]
[]
[]
[]
[]
[]
[]
[]
[]
[]
[]
[]
[]
[]
[]
[]
[]
[]
[]
[]
[]
[]
[]
[]
[]
[]
[]
[]
[]
[]
[]
[]
[]
[]
[]
[]
[]
[]
[]
[]
[]
[]
[]
[]
[]
[]
[]
[]
[]
[]
[]
[]
[]
[]
[]
[]
[]
[]
[]
[]
[]
[]
[]
[]
[]
[]
[]
[]
[]
[]
[]
[]
[]
[]
[]
[]
[]
[]
[]
[]
[]
[]
[]
[]
[]
[]
[]
[]
[]
[]
[]
[]
[]
[]
[]
[]
[]
[]
[]
[]
[]
[]
[]
[]
[]
[]
[]
[]
[]
[]
[]
[]
[]
[]
[]
[]
[]
[]
[]
[]
[]
[]
[]
[]
[]
[]
[]
[]
[]
[]
[]
[]
[]
[]
[]
[]
[]
[]
[]
[]
[]
[]
[]
[]
[]
[]
[]
[]
[]
[]
[]
[]
[]
[]
[]
[]
[]
[]
[]
[]
[]
[]
[]
[]
[]
[]
[]
[]
[]
[]
[]
[]
[]
[]
[]
[]
[]
[]
[]
[]
[]
[]
[]
[]
[]
[]
[]
[]
[]
[]
[]
[]
[]
[]
[]
[]
[]
[]
[]
[]
[]
[]
[]
[]
[]
[]
[]
[]
[]
[]
[]
[]
[]
[]
[]
[]
[]
[]
[]
[]
[]
[]
[]
[]
[]
[]
[]
[]
[]
[]
[]
[]
[]
[]
[]
[]
[]
[]
[]
[]
[]
[]
[]
[]
[]
[]
[]
[]
[]
[]
[]
[]
[]
[]
[]
[]
[]
[]
[]
[]
[]
[]
[]
[]
[]
[]
[]
[]
[]
[]
[]
[]
[]
[]
[]
[]
[]
[]
[]
[]
[]
[]
[]
[]
[]
[]
[]
[]
[]
[]
[]
[]
[]
[]
[]
[]
[]
[]
[]
[]
[]
[]
[]
[]
[]
[]
[]
[]
[]
[]
[]
[]
[]
[]
[]
[]
[]
[]
[]
[]
[]
[]
[]
[]
[]
[]
[]
[]
[]
[]
[]
[]
[]
[]
[]
[]
[]
[]
[]
[]
[]
[]
[]
[]
[]
[]
[]
[]
[]
[]
[]
[]
[]
[]
[]
[]
[]
[]
[]
[]
[]
[]
[null,null,null,null,null,null,null,null,null,null,null,null,null,null,null,null,null,null,null,null,null,null,null,null,false]

{"sheet":"TechniquesOS","index":4,"n_rows":1056,"n_cols":42,"rows_kept":1056,"cut":false,"hidden":false,"merged":[[70,6,70,7],[70,9,70,13],[70,15,70,19],[68,6,68,7],[68,9,68,13],[68,15,68,19],[69,6,69,7],[69,9,69,13],[69,15,69,19],[66,6,66,7],[66,9,66,13],[66,15,66,19],[67,6,67,7],[67,9,67,13],[67,15,67,19],[64,6,64,7],[64,9,64,13],[64,15,64,19],[65,6,65,7],[65,9,65,13],[65,15,65,19],[62,6,62,7],[62,9,62,13],[62,15,62,19],[63,6,63,7],[63,9,63,13],[63,15,63,19],[60,6,60,7],[60,9,60,13],[60,15,60,19],[61,6,61,7],[61,9,61,13],[61,15,61,19],[58,6,58,7],[58,9,58,13],[58,15,58,19],[59,6,59,7],[59,9,59,13],[59,15,59,19],[56,6,56,7],[56,9,56,13],[56,15,56,19],[57,6,57,7],[57,9,57,13],[57,15,57,19],[54,6,54,7],[54,9,54,13],[54,15,54,19],[55,6,55,7],[55,9,55,13],[55,15,55,19],[52,6,52,7],[52,9,52,13],[52,15,52,19],[53,6,53,7],[53,9,53,13],[53,15,53,19],[50,6,50,7],[50,9,50,13],[50,15,50,19],[51,6,51,7],[51,9,51,13],[51,15,51,19],[48,6,48,7],[48,9,48,13],[48,15,48,19],[49,6,49,7],[49,9,49,13],[49,15,49,19],[46,6,46,7],[46,9,46,13],[46,15,46,19],[47,6,47,7],[47,9,47,13],[47,15,47,19],[44,6,44,7],[44,9,44,13],[44,15,44,19],[45,6,45,7],[45,9,45,13],[45,15,45,19],[42,6,42,7],[42,9,42,13],[42,15,42,19],[43,6,43,7],[43,9,43,13],[43,15,43,19],[40,6,40,7],[40,9,40,13],[40,15,40,19],[41,6,41,7],[41,9,41,13],[41,15,41,19],[38,6,38,7],[38,9,38,13],[38,15,38,19],[39,6,39,7],[39,9,39,13],[39,15,39,19],[36,6,36,7],[36,9,36,13],[36,15,36,19],[37,6,37,7],[37,9,37,13],[37,15,37,19],[34,6,34,7],[34,9,34,13],[34,15,34,19],[35,6,35,7],[35,9,35,13],[35,15,35,19],[32,6,32,7],[32,9,32,13],[32,15,32,19],[33,6,33,7],[33,9,33,13],[33,15,33,19],[30,6,30,7],[30,9,30,13],[30,15,30,19],[31,6,31,7],[31,9,31,13],[31,15,31,19],[28,6,28,7],[28,9,28,13],[28,15,28,19],[29,6,29,7],[29,9,29,13],[29,15,29,19],[26,6,26,7],[26,9,26,13],[26,15,26,19],[27,6,27,7],[27,9,27,13],[27,15,27,19],[24,6,24,7],[24,9,24,13],[24,15,24,19],[25,6,25,7],[25,9,25,13],[25,15,25,19],[22,6,22,7],[22,9,22,13],[22,15,22,19],[23,6,23,7],[23,9,23,13],[23,15,23,19],[11,15,11,18],[12,16,12,18],[13,16,13,18],[16,15,16,18],[19,6,19,7],[21,6,21,7],[21,9,21,13],[21,15,21,19]]}
[]
[null,null,null,null,null,null,null,null,null,null,null,null,null,null,null,null,null,null,null,null,null,null,"Erreurs 1ers onglets:"]
[null,null,null,null,null,null,null,null,null,null,null,null,null,null,null,null,null,null,null,null,null,null,"Variante",{"$f":"Scenarios!X3","v":1}]
[null,null,null,null,null,null,null,null,null,null,null,null,null,null,null,null,null,null,null,null,null,null,"Acuueil",{"$f":"Accueil!W3","v":1}]
[null,null,null,null,null,null,null,null,null,null,null,null,null,null,null,null,null,null,null,null,null,null,"Descriptif site",{"$f":"'Descriptif site'!Z4","v":1}]
[null,null,null,null,null,null,null,null,null,null,null,null,null,null,null,null,null,null,null,null,null,null,"Choix techniques",{"$f":"TechniquesIS!$Z$20+TechniquesOS!$Z$20+TechniquesHS!Z20+TechniquesE!Z20","v":0},"Erreurs évaluations:"]
[null,null,null,null,null,null,null,null,null,null,null,null,null,null,null,null,null,null,null,null,null,null,null,{"$f":"SUM(X3:X6)","v":3},{"$f":"Accueil!X7","v":0}]
[]
[]
[]
[]
[]
[null,null,null,null,null,null,null,null,null,null,null,null,null,null,null,null,"Nombre de techniques à considérer:"]
[null,null,null,null,null,null,null,null,null,null,null,null,null,null,null,null,8]
[]
[null,null,null,null,false]
[]
[]
[null,null,null,null,null,null,null,null,null,null,null,null,null,null,null,null,null,null,null,null,null,null,null,null,{"$f":"IF(OR(Y20>10,Y20<2),1,0)","v":0}]
[null,null,null,"N°","Technique activée?",null,"Nom de la technique",null,null,"Description de la technique",null,null,null,null,null,"Justification",null,null,null,null,null,null,null,null,{"$f":"COUNTIF(Y22:Y28,TRUE)","v":7},{"$f":"COUNTIF(Z22:Z72,\"non completé\")","v":0}]
[null,null,null,null,null,null,null,null,null,null,null,null,null,null,null,null,null,null,null,null,null,null,null,null,null,null,null,null,null,null,null,null,null,null,null,null,null,null,null,null,null,0]
[null,null,null,"Technique 1",null,null,"OS1",null,null,"Excavation et incinération",null,null,null,null,null,null,null,null,null,null,null,null,null,null,true,{"$f":"IF(AND(Y22=FALSE,P22=\"\"),\"non completé\", \"ok\")","v":"ok"}]
[null,null,null,"Technique 2",null,null,"OS2",null,null,"Excavation et traitement thermique",null,null,null,null,null,null,null,null,null,null,null,null,null,null,true,{"$f":"IF(AND(Y23=FALSE,P23=\"\"),\"non completé\", \"ok\")","v":"ok"}]
[null,null,null,"Technique 3",null,null,"OS3",null,null,"Excavation et traitement physico-chimique",null,null,null,null,null,null,null,null,null,null,null,null,null,null,true,"ok"]
[null,null,null,"Technique 4",null,null,"OS4",null,null,"Excavation et traitement biologique",null,null,null,null,null,null,null,null,null,null,null,null,null,null,true,"ok"]
[null,null,null,"Technique 5",null,null,"OS5",null,null,"Excavation et encapsulation sur site",null,null,null,null,null,null,null,null,null,null,null,null,null,null,true,"ok"]
[null,null,null,"Technique 6",null,null,"OS6",null,null,"Excavation et compostage, landfarming",null,null,null,null,null,null,null,null,null,null,null,null,null,null,true,"ok"]
[null,null,null,"Technique 7",null,null,"OS7",null,null,"Excavation et biopile",null,null,null,null,null,null,null,null,null,null,null,null,null,null,true,"ok"]
[null,null,null,"Technique 8",null,null,"OS8",null,null,"Excavation et lavage à l'eau",null,null,null,null,null,null,null,null,null,null,null,null,null,null,true,"ok"]
[null,null,null,"Technique 9",null,null,"OS9",null,null,"Donnez une description…",null,null,null,null,null,null,null,null,null,null,null,null,null,null,true,"ok"]
[null,null,null,"Technique 10",null,null,"OS10",null,null,"Donnez une description…",null,null,null,null,null,null,null,null,null,null,null,null,null,null,true,"ok"]
[null,null,null,"Technique 11",null,null,"OS11",null,null,"Donnez une description…",null,null,null,null,null,null,null,null,null,null,null,null,null,null,true,"ok"]
[null,null,null,"Technique 12",null,null,"OS12",null,null,"Donnez une description…",null,null,null,null,null,null,null,null,null,null,null,null,null,null,true,"ok"]
[null,null,null,"Technique 13",null,null,"OS13",null,null,"Donnez une description…",null,null,null,null,null,null,null,null,null,null,null,null,null,null,true,"ok"]
[null,null,null,"Technique 14",null,null,"OS14",null,null,"Donnez une description…",null,null,null,null,null,null,null,null,null,null,null,null,null,null,true,"ok"]
[null,null,null,"Technique 15",null,null,"OS15",null,null,"Donnez une description…",null,null,null,null,null,null,null,null,null,null,null,null,null,null,true,"ok"]
[null,null,null,"Technique 16",null,null,"OS16",null,null,"Donnez une description…",null,null,null,null,null,null,null,null,null,null,null,null,null,null,true,{"$f":"IF(AND(Y37=FALSE,P37=\"\"),\"non completé\", \"ok\")","v":"ok"}]
[null,null,null,"Technique 17",null,null,"OS17",null,null,"Donnez une description…",null,null,null,null,null,null,null,null,null,null,null,null,null,null,true,{"$f":"IF(AND(Y38=FALSE,P38=\"\"),\"non completé\", \"ok\")","v":"ok"}]
[null,null,null,"Technique 18",null,null,"OS18",null,null,"Donnez une description…",null,null,null,null,null,null,null,null,null,null,null,null,null,null,true,"ok"]
[null,null,null,"Technique 19",null,null,"OS19",null,null,"Donnez une description…",null,null,null,null,null,null,null,null,null,null,null,null,null,null,true,"ok"]
[null,null,null,"Technique 20",null,null,"OS20",null,null,"Donnez une description…",null,null,null,null,null,null,null,null,null,null,null,null,null,null,true,"ok"]
[null,null,null,"Technique 21",null,null,"OS21",null,null,"Donnez une description…",null,null,null,null,null,null,null,null,null,null,null,null,null,null,true,"ok"]
[null,null,null,"Technique 22",null,null,"OS22",null,null,"Donnez une description…",null,null,null,null,null,null,null,null,null,null,null,null,null,null,true,"ok"]
[null,null,null,"Technique 23",null,null,"OS23",null,null,"Donnez une description…",null,null,null,null,null,null,null,null,null,null,null,null,null,null,true,"ok"]
[null,null,null,"Technique 24",null,null,"OS24",null,null,"Donnez une description…",null,null,null,null,null,null,null,null,null,null,null,null,null,null,true,"ok"]
[null,null,null,"Technique 25",null,null,"OS25",null,null,"Donnez une description…",null,null,null,null,null,null,null,null,null,null,null,null,null,null,true,"ok"]
[null,null,null,"Technique 26",null,null,"OS26",null,null,"Donnez une description…",null,null,null,null,null,null,null,null,null,null,null,null,null,null,true,"ok"]
[null,null,null,"Technique 27",null,null,"OS27",null,null,"Donnez une description…",null,null,null,null,null,null,null,null,null,null,null,null,null,null,true,"ok"]
[null,null,null,"Technique 28",null,null,"OS28",null,null,"Donnez une description…",null,null,null,null,null,null,null,null,null,null,null,null,null,null,true,"ok"]
[null,null,null,"Technique 29",null,null,"OS29",null,null,"Donnez une description…",null,null,null,null,null,null,null,null,null,null,null,null,null,null,true,"ok"]
[null,null,null,"Technique 30",null,null,"OS30",null,null,"Donnez une description…",null,null,null,null,null,null,null,null,null,null,null,null,null,null,true,"ok"]
[null,null,null,"Technique 31",null,null,"OS31",null,null,"Donnez une description…",null,null,null,null,null,null,null,null,null,null,null,null,null,null,true,{"$f":"IF(AND(Y52=FALSE,P52=\"\"),\"non completé\", \"ok\")","v":"ok"}]
[null,null,null,"Technique 32",null,null,"OS32",null,null,"Donnez une description…",null,null,null,null,null,null,null,null,null,null,null,null,null,null,true,{"$f":"IF(AND(Y53=FALSE,P53=\"\"),\"non completé\", \"ok\")","v":"ok"}]
[null,null,null,"Technique 33",null,null,"OS33",null,null,"Donnez une description…",null,null,null,null,null,null,null,null,null,null,null,null,null,null,true,"ok"]
[null,null,null,"Technique 34",null,null,"OS34",null,null,"Donnez une description…",null,null,null,null,null,null,null,null,null,null,null,null,null,null,true,"ok"]
[null,null,null,"Technique 35",null,null,"OS35",null,null,"Donnez une description…",null,null,null,null,null,null,null,null,null,null,null,null,null,null,true,"ok"]
[null,null,null,"Technique 36",null,null,"OS36",null,null,"Donnez une description…",null,null,null,null,null,null,null,null,null,null,null,null,null,null,true,"ok"]
[null,null,null,"Technique 37",null,null,"OS37",null,null,"Donnez une description…",null,null,null,null,null,null,null,null,null,null,null,null,null,null,true,"ok"]
[null,null,null,"Technique 38",null,null,"OS38",null,null,"Donnez une description…",null,null,null,null,null,null,null,null,null,null,null,null,null,null,true,"ok"]
[null,null,null,"Technique 39",null,null,"OS39",null,null,"Donnez une description…",null,null,null,null,null,null,null,null,null,null,null,null,null,null,true,"ok"]
[null,null,null,"Technique 40",null,null,"OS40",null,null,"Donnez une description…",null,null,null,null,null,null,null,null,null,null,null,null,null,null,true,"ok"]
[null,null,null,"Technique 41",null,null,"OS41",null,null,"Donnez une description…",null,null,null,null,null,null,null,null,null,null,null,null,null,null,true,"ok"]
[null,null,null,"Technique 42",null,null,"OS42",null,null,"Donnez une description…",null,null,null,null,null,null,null,null,null,null,null,null,null,null,true,"ok"]
[null,null,null,"Technique 43",null,null,"OS43",null,null,"Donnez une description…",null,null,null,null,null,null,null,null,null,null,null,null,null,null,true,"ok"]
[null,null,null,"Technique 44",null,null,"OS44",null,null,"Donnez une description…",null,null,null,null,null,null,null,null,null,null,null,null,null,null,true,"ok"]
[null,null,null,"Technique 45",null,null,"OS45",null,null,"Donnez une description…",null,null,null,null,null,null,null,null,null,null,null,null,null,null,true,"ok"]
[null,null,null,"Technique 46",null,null,"OS46",null,null,"Donnez une description…",null,null,null,null,null,null,null,null,null,null,null,null,null,null,true,{"$f":"IF(AND(Y67=FALSE,P67=\"\"),\"non completé\", \"ok\")","v":"ok"}]
[null,null,null,"Technique 47",null,null,"OS47",null,null,"Donnez une description…",null,null,null,null,null,null,null,null,null,null,null,null,null,null,true,{"$f":"IF(AND(Y68=FALSE,P68=\"\"),\"non completé\", \"ok\")","v":"ok"}]
[null,null,null,"Technique 48",null,null,"OS48",null,null,"Donnez une description…",null,null,null,null,null,null,null,null,null,null,null,null,null,null,true,"ok"]
[null,null,null,"Technique 49",null,null,"OS49",null,null,"Donnez une description…",null,null,null,null,null,null,null,null,null,null,null,null,null,null,true,"ok"]
[null,null,null,"Technique 50",null,null,"OS50",null,null,"Donnez une description…",null,null,null,null,null,null,null,null,null,null,null,null,null,null,true,"ok"]
[]
[]
[]
[]
[]
[]
[]
[]
[]
[]
[]
[]
[]
[]
[]
[]
[]
[]
[]
[]
[]
[]
[]
[]
[]
[]
[]
[]
[]
[]
[]
[]
[]
[]
[]
[]
[]
[]
[]
[]
[]
[]
[]
[]
[]
[]
[]
[]
[]
[]
[]
[]
[]
[]
[]
[]
[]
[]
[]
[]
[]
[]
[]
[]
[]
[]
[]
[]
[]
[]
[]
[]
[]
[]
[]
[]
[]
[]
[]
[]
[]
[]
[]
[]
[]
[]
[]
[]
[]
[]
[]
[]
[]
[]
[]
[]
[]
[]
[]
[]
[]
[]
[]
[]
[]
[]
[]
[]
[]
[]
[]
[]
[]
[]
[]
[]
[]
[]
[]
[]
[]
[]
[]
[]
[]
[]
[]
[]
[]
[]
[]
[]
[]
[]
[]
[]
[]
[]
[]
[]
[]
[]
[]
[]
[]
[]
[]
[]
[]
[]
[]
[]
[]
[]
[]
[]
[]
[]
[]
[]
[]
[]
[]
[]
[]
[]
[]
[]
[]
[]
[]
[]
[]
[]
[]
[]
[]
[]
[]
[]
[]
[]
[]
[]
[]
[]
[]
[]
[]
[]
[]
[]
[]
[]
[]
[]
[]
[]
[]
[]
[]
[]
[]
[]
[]
[]
[]
[]
[]
[]
[]
[]
[]
[]
[]
[]
[]
[]
[]
[]
[]
[]
[]
[]
[]
[]
[]
[]
[]
[]
[]
[]
[]
[]
[]
[]
[]
[]
[]
[]
[]
[]
[]
[]
[]
[]
[]
[]
[]
[]
[]
[]
[]
[]
[]
[]
[]
[]
[]
[]
[]
[]
[]
[]
[]
[]
[]
[]
[]
[]
[]
[]
[]
[]
[]
[]
[]
[]
[]
[]
[]
[]
[]
[]
[]
[]
[]
[]
[]
[]
[]
[]
[]
[]
[]
[]
[]
[]
[]
[]
[]
[]
[]
[]
[]
[]
[]
[]
[]
[]
[]
[]
[]
[]
[]
[]
[]
[]
[]
[]
[]
[]
[]
[]
[]
[]
[]
[]
[]
[]
[]
[]
[]
[]
[]
[]
[]
[]
[]
[]
[]
[]
[]
[]
[]
[]
[]
[]
[]
[]
[]
[]
[]
[]
[]
[]
[]
[]
[]
[]
[]
[]
[]
[]
[]
[]
[]
[]
[]
[]
[]
[]
[]
[]
[]
[]
[]
[]
[]
[]
[]
[]
[]
[]
[]
[]
[]
[]
[]
[]
[]
[]
[]
[]
[]
[]
[]
[]
[]
[]
[]
[]
[]
[]
[]
[]
[]
[]
[]
[]
[]
[]
[]
[]
[]
[]
[]
[]
[]
[]
[]
[]
[]
[]
[]
[]
[]
[]
[]
[]
[]
[]
[]
[]
[]
[]
[]
[]
[]
[]
[]
[]
[]
[]
[]
[]
[]
[]
[]
[]
[]
[]
[]
[]
[]
[]
[]
[]
[]
[]
[]
[]
[]
[]
[]
[]
[]
[]
[]
[]
[]
[]
[]
[]
[]
[]
[]
[]
[]
[]
[]
[]
[]
[]
[]
[]
[]
[]
[]
[]
[]
[]
[]
[]
[]
[]
[]
[]
[]
[]
[]
[]
[]
[]
[]
[]
[]
[]
[]
[]
[]
[]
[]
[]
[]
[]
[]
[]
[]
[]
[]
[]
[]
[]
[]
[]
[]
[]
[]
[]
[]
[]
[]
[]
[]
[]
[]
[]
[]
[]
[]
[]
[]
[]
[]
[]
[]
[]
[]
[]
[]
[]
[]
[]
[]
[]
[]
[]
[]
[]
[]
[]
[]
[]
[]
[]
[]
[]
[]
[]
[]
[]
[]
[]
[]
[]
[]
[]
[]
[]
[]
[]
[]
[]
[]
[]
[]
[]
[]
[]
[]
[]
[]
[]
[]
[]
[]
[]
[]
[]
[]
[]
[]
[]
[]
[]
[]
[]
[]
[]
[]
[]
[]
[]
[]
[]
[]
[]
[]
[]
[]
[]
[]
[]
[]
[]
[]
[]
[]
[]
[]
[]
[]
[]
[]
[]
[]
[]
[]
[]
[]
[]
[]
[]
[]
[]
[]
[]
[]
[]
[]
[]
[]
[]
[]
[]
[]
[]
[]
[]
[]
[]
[]
[]
[]
[]
[]
[]
[]
[]
[]
[]
[]
[]
[]
[]
[]
[]
[]
[]
[]
[]
[]
[]
[]
[]
[]
[]
[]
[]
[]
[]
[]
[]
[]
[]
[]
[]
[]
[]
[]
[]
[]
[]
[]
[]
[]
[]
[]
[]
[]
[]
[]
[]
[]
[]
[]
[]
[]
[]
[]
[]
[]
[]
[]
[]
[]
[]
[]
[]
[]
[]
[]
[]
[]
[]
[]
[]
[]
[]
[]
[]
[]
[]
[]
[]
[]
[]
[]
[]
[]
[]
[]
[]
[]
[]
[]
[]
[]
[]
[]
[]
[]
[]
[]
[]
[]
[]
[]
[]
[]
[]
[]
[]
[]
[]
[]
[]
[]
[]
[]
[]
[]
[]
[]
[]
[]
[]
[]
[]
[]
[]
[]
[]
[]
[]
[]
[]
[]
[]
[]
[]
[]
[]
[]
[]
[]
[]
[]
[]
[]
[]
[]
[]
[]
[]
[]
[]
[]
[]
[]
[]
[]
[]
[]
[]
[]
[]
[]
[]
[]
[]
[]
[]
[]
[]
[]
[]
[]
[]
[]
[]
[]
[]
[]
[]
[]
[]
[]
[]
[]
[]
[]
[]
[]
[]
[]
[]
[]
[]
[]
[]
[]
[]
[]
[]
[]
[]
[]
[]
[]
[]
[]
[]
[]
[]
[]
[]
[]
[]
[]
[]
[]
[]
[]
[]
[]
[]
[]
[]
[]
[]
[]
[]
[]
[]
[]
[]
[]
[]
[]
[]
[]
[]
[]
[]
[]
[]
[]
[]
[]
[]
[]
[]
[]
[]
[]
[]
[]
[]
[]
[]
[]
[]
[]
[]
[]
[]
[]
[]
[]
[]
[]
[]
[]
[]
[]
[]
[]
[]
[]
[]
[]
[]
[]
[]
[]
[]
[]
[]
[]
[]
[]
[]
[]
[]
[]
[]
[]
[]
[]
[]
[]
[]
[]
[]
[]
[]
[]
[]
[]
[]
[]
[]
[]
[]
[]
[]
[]
[]
[]
[]
[]
[]
[null,null,null,null,null,null,null,null,null,null,null,null,null,null,null,null,null,null,null,null,null,null,null,null,false]

{"sheet":"TechniquesIS","index":5,"n_rows":1056,"n_cols":42,"rows_kept":1056,"cut":false,"hidden":false,"merged":[[70,6,70,7],[70,9,70,13],[70,15,70,19],[68,6,68,7],[68,9,68,13],[68,15,68,19],[69,6,69,7],[69,9,69,13],[69,15,69,19],[66,6,66,7],[66,9,66,13],[66,15,66,19],[67,6,67,7],[67,9,67,13],[67,15,67,19],[64,6,64,7],[64,9,64,13],[64,15,64,19],[65,6,65,7],[65,9,65,13],[65,15,65,19],[62,6,62,7],[62,9,62,13],[62,15,62,19],[63,6,63,7],[63,9,63,13],[63,15,63,19],[60,6,60,7],[60,9,60,13],[60,15,60,19],[61,6,61,7],[61,9,61,13],[61,15,61,19],[58,6,58,7],[58,9,58,13],[58,15,58,19],[59,6,59,7],[59,9,59,13],[59,15,59,19],[56,6,56,7],[56,9,56,13],[56,15,56,19],[57,6,57,7],[57,9,57,13],[57,15,57,19],[54,6,54,7],[54,9,54,13],[54,15,54,19],[55,6,55,7],[55,9,55,13],[55,15,55,19],[52,6,52,7],[52,9,52,13],[52,15,52,19],[53,6,53,7],[53,9,53,13],[53,15,53,19],[50,6,50,7],[50,9,50,13],[50,15,50,19],[51,6,51,7],[51,9,51,13],[51,15,51,19],[48,6,48,7],[48,9,48,13],[48,15,48,19],[49,6,49,7],[49,9,49,13],[49,15,49,19],[46,6,46,7],[46,9,46,13],[46,15,46,19],[47,6,47,7],[47,9,47,13],[47,15,47,19],[44,6,44,7],[44,9,44,13],[44,15,44,19],[45,6,45,7],[45,9,45,13],[45,15,45,19],[42,6,42,7],[42,9,42,13],[42,15,42,19],[43,6,43,7],[43,9,43,13],[43,15,43,19],[40,6,40,7],[40,9,40,13],[40,15,40,19],[41,6,41,7],[41,9,41,13],[41,15,41,19],[38,6,38,7],[38,9,38,13],[38,15,38,19],[39,6,39,7],[39,9,39,13],[39,15,39,19],[36,6,36,7],[36,9,36,13],[36,15,36,19],[37,6,37,7],[37,9,37,13],[37,15,37,19],[34,6,34,7],[34,9,34,13],[34,15,34,19],[35,6,35,7],[35,9,35,13],[35,15,35,19],[32,6,32,7],[32,9,32,13],[32,15,32,19],[33,6,33,7],[33,9,33,13],[33,15,33,19],[30,6,30,7],[30,9,30,13],[30,15,30,19],[31,6,31,7],[31,9,31,13],[31,15,31,19],[28,6,28,7],[28,9,28,13],[28,15,28,19],[29,6,29,7],[29,9,29,13],[29,15,29,19],[26,6,26,7],[26,9,26,13],[26,15,26,19],[27,6,27,7],[27,9,27,13],[27,15,27,19],[24,6,24,7],[24,9,24,13],[24,15,24,19],[25,6,25,7],[25,9,25,13],[25,15,25,19],[22,6,22,7],[22,9,22,13],[22,15,22,19],[23,6,23,7],[23,9,23,13],[23,15,23,19],[11,15,11,18],[12,16,12,18],[13,16,13,18],[16,15,16,18],[19,6,19,7],[21,6,21,7],[21,9,21,13],[21,15,21,19]]}
[]
[null,null,null,null,null,null,null,null,null,null,null,null,null,null,null,null,null,null,null,null,null,null,"Erreurs 1ers onglets:"]
[null,null,null,null,null,null,null,null,null,null,null,null,null,null,null,null,null,null,null,null,null,null,"Variante",{"$f":"Scenarios!X3","v":1}]
[null,null,null,null,null,null,null,null,null,null,null,null,null,null,null,null,null,null,null,null,null,null,"Acuueil",{"$f":"Accueil!W3","v":1}]
[null,null,null,null,null,null,null,null,null,null,null,null,null,null,null,null,null,null,null,null,null,null,"Descriptif site",{"$f":"'Descriptif site'!Z4","v":1}]
[null,null,null,null,null,null,null,null,null,null,null,null,null,null,null,null,null,null,null,null,null,null,"Choix techniques",{"$f":"TechniquesIS!$Z$20+TechniquesOS!$Z$20+TechniquesHS!Z20+TechniquesE!Z20","v":0},"Erreurs évaluations:"]
[null,null,null,null,null,null,null,null,null,null,null,null,null,null,null,null,null,null,null,null,null,null,null,{"$f":"SUM(X3:X6)","v":3},{"$f":"Accueil!X7","v":0}]
[]
[]
[]
[]
[]
[null,null,null,null,null,null,null,null,null,null,null,null,null,null,null,null,"Nombre de techniques à considérer:"]
[null,null,null,null,null,null,null,null,null,null,null,null,null,null,null,null,17]
[]
[null,null,null,null,false]
[]
[]
[null,null,null,null,null,null,null,null,null,null,null,null,null,null,null,null,null,null,null,null,null,null,null,null,{"$f":"IF(OR(Y20>10,Y20<2),1,0)","v":0}]
[null,null,null,"N°","Technique activée?",null,"Nom de la technique",null,null,"Description de la technique",null,null,null,null,null,"Justification",null,null,null,null,null,null,null,null,{"$f":"COUNTIF(Y22:Y28,TRUE)","v":7},{"$f":"COUNTIF(Z22:Z72,\"non completé\")","v":0}]
[null,null,null,null,null,null,null,null,null,null,null,null,null,null,null,null,null,null,null,null,null,null,null,null,null,null,null,null,null,null,null,null,null,null,null,null,null,null,null,null,null,0]
[null,null,null,"Technique 1",null,null,"IS1",null,null,"Confinement par couverture et étanchéification",null,null,null,null,null,null,null,null,null,null,null,null,null,null,true,{"$f":"IF(AND(Y22=FALSE,P22=\"\"),\"non completé\", \"ok\")","v":"ok"}]
[null,null,null,"Technique 2",null,null,"IS2",null,null,"Lavage de sol",null,null,null,null,null,null,null,null,null,null,null,null,null,null,true,{"$f":"IF(AND(Y23=FALSE,P23=\"\"),\"non completé\", \"ok\")","v":"ok"}]
[null,null,null,"Technique 3",null,null,"IS3",null,null,"Biostimulation/biodégradation/précipitation accélérée insitu",null,null,null,null,null,null,null,null,null,null,null,null,null,null,true,"ok"]
[null,null,null,"Technique 4",null,null,"IS4",null,null,"Réduction chimique insitu",null,null,null,null,null,null,null,null,null,null,null,null,null,null,true,"ok"]
[null,null,null,"Technique 5",null,null,"IS5",null,null,"Oxydation chimique insitu",null,null,null,null,null,null,null,null,null,null,null,null,null,null,true,"ok"]
[null,null,null,"Technique 6",null,null,"IS6",null,null,"Extraction multiphase",null,null,null,null,null,null,null,null,null,null,null,null,null,null,true,"ok"]
[null,null,null,"Technique 7",null,null,"IS7",null,null,"SVE (Soil Vapor Extraction)",null,null,null,null,null,null,null,null,null,null,null,null,null,null,true,"ok"]
[null,null,null,"Technique 8",null,null,"IS8",null,null,"Air sparging, bioventing",null,null,null,null,null,null,null,null,null,null,null,null,null,null,true,"ok"]
[null,null,null,"Technique 9",null,null,"IS9",null,null,"Phytoremediation insitu",null,null,null,null,null,null,null,null,null,null,null,null,null,null,true,"ok"]
[null,null,null,"Technique 10",null,null,"IS10",null,null,"Vitrification Insitu",null,null,null,null,null,null,null,null,null,null,null,null,null,null,true,"ok"]
[null,null,null,"Technique 11",null,null,"IS11",null,null,"Solidification",null,null,null,null,null,null,null,null,null,null,null,null,null,null,true,"ok"]
[null,null,null,"Technique 12",null,null,"IS12",null,null,"Stabilisation chimique",null,null,null,null,null,null,null,null,null,null,null,null,null,null,true,"ok"]
[null,null,null,"Technique 13",null,null,"IS13",null,null,"Désorption thermique insitu par injection de vapeur",null,null,null,null,null,null,null,null,null,null,null,null,null,null,true,"ok"]
[null,null,null,"Technique 14",null,null,"IS14",null,null,"Désorption thermique insitu par six phases heating ou électrocinétique",null,null,null,null,null,null,null,null,null,null,null,null,null,null,true,"ok"]
[null,null,null,"Technique 15",null,null,"IS15",null,null,"Désorption thermique insitu par conduction de chaleur",null,null,null,null,null,null,null,null,null,null,null,null,null,null,true,"ok"]
[null,null,null,"Technique 16",null,null,"IS16",null,null,"Soil mixing + combinaison technique insitu",null,null,null,null,null,null,null,null,null,null,null,null,null,null,true,{"$f":"IF(AND(Y37=FALSE,P37=\"\"),\"non completé\", \"ok\")","v":"ok"}]
[null,null,null,"Technique 17",null,null,"IS17",null,null,"Combustion Insitu",null,null,null,null,null,null,null,null,null,null,null,null,null,null,true,{"$f":"IF(AND(Y38=FALSE,P38=\"\"),\"non completé\", \"ok\")","v":"ok"}]
[null,null,null,"Technique 18",null,null,"IS18",null,null,"Donnez une description…",null,null,null,null,null,null,null,null,null,null,null,null,null,null,true,"ok"]
[null,null,null,"Technique 19",null,null,"IS19",null,null,"Donnez une description…",null,null,null,null,null,null,null,null,null,null,null,null,null,null,true,"ok"]
[null,null,null,"Technique 20",null,null,"IS20",null,null,"Donnez une description…",null,null,null,null,null,null,null,null,null,null,null,null,null,null,true,"ok"]
[null,null,null,"Technique 21",null,null,"IS21",null,null,"Donnez une description…",null,null,null,null,null,null,null,null,null,null,null,null,null,null,true,"ok"]
[null,null,null,"Technique 22",null,null,"IS22",null,null,"Donnez une description…",null,null,null,null,null,null,null,null,null,null,null,null,null,null,true,"ok"]
[null,null,null,"Technique 23",null,null,"IS23",null,null,"Donnez une description…",null,null,null,null,null,null,null,null,null,null,null,null,null,null,true,"ok"]
[null,null,null,"Technique 24",null,null,"IS24",null,null,"Donnez une description…",null,null,null,null,null,null,null,null,null,null,null,null,null,null,true,"ok"]
[null,null,null,"Technique 25",null,null,"IS25",null,null,"Donnez une description…",null,null,null,null,null,null,null,null,null,null,null,null,null,null,true,"ok"]
[null,null,null,"Technique 26",null,null,"IS26",null,null,"Donnez une description…",null,null,null,null,null,null,null,null,null,null,null,null,null,null,true,"ok"]
[null,null,null,"Technique 27",null,null,"IS27",null,null,"Donnez une description…",null,null,null,null,null,null,null,null,null,null,null,null,null,null,true,"ok"]
[null,null,null,"Technique 28",null,null,"IS28",null,null,"Donnez une description…",null,null,null,null,null,null,null,null,null,null,null,null,null,null,true,"ok"]
[null,null,null,"Technique 29",null,null,"IS29",null,null,"Donnez une description…",null,null,null,null,null,null,null,null,null,null,null,null,null,null,true,"ok"]
[null,null,null,"Technique 30",null,null,"IS30",null,null,"Donnez une description…",null,null,null,null,null,null,null,null,null,null,null,null,null,null,true,"ok"]
[null,null,null,"Technique 31",null,null,"IS31",null,null,"Donnez une description…",null,null,null,null,null,null,null,null,null,null,null,null,null,null,true,{"$f":"IF(AND(Y52=FALSE,P52=\"\"),\"non completé\", \"ok\")","v":"ok"}]
[null,null,null,"Technique 32",null,null,"IS32",null,null,"Donnez une description…",null,null,null,null,null,null,null,null,null,null,null,null,null,null,true,{"$f":"IF(AND(Y53=FALSE,P53=\"\"),\"non completé\", \"ok\")","v":"ok"}]
[null,null,null,"Technique 33",null,null,"IS33",null,null,"Donnez une description…",null,null,null,null,null,null,null,null,null,null,null,null,null,null,true,"ok"]
[null,null,null,"Technique 34",null,null,"IS34",null,null,"Donnez une description…",null,null,null,null,null,null,null,null,null,null,null,null,null,null,true,"ok"]
[null,null,null,"Technique 35",null,null,"IS35",null,null,"Donnez une description…",null,null,null,null,null,null,null,null,null,null,null,null,null,null,true,"ok"]
[null,null,null,"Technique 36",null,null,"IS36",null,null,"Donnez une description…",null,null,null,null,null,null,null,null,null,null,null,null,null,null,true,"ok"]
[null,null,null,"Technique 37",null,null,"IS37",null,null,"Donnez une description…",null,null,null,null,null,null,null,null,null,null,null,null,null,null,true,"ok"]
[null,null,null,"Technique 38",null,null,"IS38",null,null,"Donnez une description…",null,null,null,null,null,null,null,null,null,null,null,null,null,null,true,"ok"]
[null,null,null,"Technique 39",null,null,"IS39",null,null,"Donnez une description…",null,null,null,null,null,null,null,null,null,null,null,null,null,null,true,"ok"]
[null,null,null,"Technique 40",null,null,"IS40",null,null,"Donnez une description…",null,null,null,null,null,null,null,null,null,null,null,null,null,null,true,"ok"]
[null,null,null,"Technique 41",null,null,"IS41",null,null,"Donnez une description…",null,null,null,null,null,null,null,null,null,null,null,null,null,null,true,"ok"]
[null,null,null,"Technique 42",null,null,"IS42",null,null,"Donnez une description…",null,null,null,null,null,null,null,null,null,null,null,null,null,null,true,"ok"]
[null,null,null,"Technique 43",null,null,"IS43",null,null,"Donnez une description…",null,null,null,null,null,null,null,null,null,null,null,null,null,null,true,"ok"]
[null,null,null,"Technique 44",null,null,"IS44",null,null,"Donnez une description…",null,null,null,null,null,null,null,null,null,null,null,null,null,null,true,"ok"]
[null,null,null,"Technique 45",null,null,"IS45",null,null,"Donnez une description…",null,null,null,null,null,null,null,null,null,null,null,null,null,null,true,"ok"]
[null,null,null,"Technique 46",null,null,"IS46",null,null,"Donnez une description…",null,null,null,null,null,null,null,null,null,null,null,null,null,null,true,{"$f":"IF(AND(Y67=FALSE,P67=\"\"),\"non completé\", \"ok\")","v":"ok"}]
[null,null,null,"Technique 47",null,null,"IS47",null,null,"Donnez une description…",null,null,null,null,null,null,null,null,null,null,null,null,null,null,true,{"$f":"IF(AND(Y68=FALSE,P68=\"\"),\"non completé\", \"ok\")","v":"ok"}]
[null,null,null,"Technique 48",null,null,"IS48",null,null,"Donnez une description…",null,null,null,null,null,null,null,null,null,null,null,null,null,null,true,"ok"]
[null,null,null,"Technique 49",null,null,"IS49",null,null,"Donnez une description…",null,null,null,null,null,null,null,null,null,null,null,null,null,null,true,"ok"]
[null,null,null,"Technique 50",null,null,"IS50",null,null,"Donnez une description…",null,null,null,null,null,null,null,null,null,null,null,null,null,null,true,"ok"]
[]
[]
[]
[]
[]
[]
[]
[]
[]
[]
[]
[]
[]
[]
[]
[]
[]
[]
[]
[]
[]
[]
[]
[]
[]
[]
[]
[]
[]
[]
[]
[]
[]
[]
[]
[]
[]
[]
[]
[]
[]
[]
[]
[]
[]
[]
[]
[]
[]
[]
[]
[]
[]
[]
[]
[]
[]
[]
[]
[]
[]
[]
[]
[]
[]
[]
[]
[]
[]
[]
[]
[]
[]
[]
[]
[]
[]
[]
[]
[]
[]
[]
[]
[]
[]
[]
[]
[]
[]
[]
[]
[]
[]
[]
[]
[]
[]
[]
[]
[]
[]
[]
[]
[]
[]
[]
[]
[]
[]
[]
[]
[]
[]
[]
[]
[]
[]
[]
[]
[]
[]
[]
[]
[]
[]
[]
[]
[]
[]
[]
[]
[]
[]
[]
[]
[]
[]
[]
[]
[]
[]
[]
[]
[]
[]
[]
[]
[]
[]
[]
[]
[]
[]
[]
[]
[]
[]
[]
[]
[]
[]
[]
[]
[]
[]
[]
[]
[]
[]
[]
[]
[]
[]
[]
[]
[]
[]
[]
[]
[]
[]
[]
[]
[]
[]
[]
[]
[]
[]
[]
[]
[]
[]
[]
[]
[]
[]
[]
[]
[]
[]
[]
[]
[]
[]
[]
[]
[]
[]
[]
[]
[]
[]
[]
[]
[]
[]
[]
[]
[]
[]
[]
[]
[]
[]
[]
[]
[]
[]
[]
[]
[]
[]
[]
[]
[]
[]
[]
[]
[]
[]
[]
[]
[]
[]
[]
[]
[]
[]
[]
[]
[]
[]
[]
[]
[]
[]
[]
[]
[]
[]
[]
[]
[]
[]
[]
[]
[]
[]
[]
[]
[]
[]
[]
[]
[]
[]
[]
[]
[]
[]
[]
[]
[]
[]
[]
[]
[]
[]
[]
[]
[]
[]
[]
[]
[]
[]
[]
[]
[]
[]
[]
[]
[]
[]
[]
[]
[]
[]
[]
[]
[]
[]
[]
[]
[]
[]
[]
[]
[]
[]
[]
[]
[]
[]
[]
[]
[]
[]
[]
[]
[]
[]
[]
[]
[]
[]
[]
[]
[]
[]
[]
[]
[]
[]
[]
[]
[]
[]
[]
[]
[]
[]
[]
[]
[]
[]
[]
[]
[]
[]
[]
[]
[]
[]
[]
[]
[]
[]
[]
[]
[]
[]
[]
[]
[]
[]
[]
[]
[]
[]
[]
[]
[]
[]
[]
[]
[]
[]
[]
[]
[]
[]
[]
[]
[]
[]
[]
[]
[]
[]
[]
[]
[]
[]
[]
[]
[]
[]
[]
[]
[]
[]
[]
[]
[]
[]
[]
[]
[]
[]
[]
[]
[]
[]
[]
[]
[]
[]
[]
[]
[]
[]
[]
[]
[]
[]
[]
[]
[]
[]
[]
[]
[]
[]
[]
[]
[]
[]
[]
[]
[]
[]
[]
[]
[]
[]
[]
[]
[]
[]
[]
[]
[]
[]
[]
[]
[]
[]
[]
[]
[]
[]
[]
[]
[]
[]
[]
[]
[]
[]
[]
[]
[]
[]
[]
[]
[]
[]
[]
[]
[]
[]
[]
[]
[]
[]
[]
[]
[]
[]
[]
[]
[]
[]
[]
[]
[]
[]
[]
[]
[]
[]
[]
[]
[]
[]
[]
[]
[]
[]
[]
[]
[]
[]
[]
[]
[]
[]
[]
[]
[]
[]
[]
[]
[]
[]
[]
[]
[]
[]
[]
[]
[]
[]
[]
[]
[]
[]
[]
[]
[]
[]
[]
[]
[]
[]
[]
[]
[]
[]
[]
[]
[]
[]
[]
[]
[]
[]
[]
[]
[]
[]
[]
[]
[]
[]
[]
[]
[]
[]
[]
[]
[]
[]
[]
[]
[]
[]
[]
[]
[]
[]
[]
[]
[]
[]
[]
[]
[]
[]
[]
[]
[]
[]
[]
[]
[]
[]
[]
[]
[]
[]
[]
[]
[]
[]
[]
[]
[]
[]
[]
[]
[]
[]
[]
[]
[]
[]
[]
[]
[]
[]
[]
[]
[]
[]
[]
[]
[]
[]
[]
[]
[]
[]
[]
[]
[]
[]
[]
[]
[]
[]
[]
[]
[]
[]
[]
[]
[]
[]
[]
[]
[]
[]
[]
[]
[]
[]
[]
[]
[]
[]
[]
[]
[]
[]
[]
[]
[]
[]
[]
[]
[]
[]
[]
[]
[]
[]
[]
[]
[]
[]
[]
[]
[]
[]
[]
[]
[]
[]
[]
[]
[]
[]
[]
[]
[]
[]
[]
[]
[]
[]
[]
[]
[]
[]
[]
[]
[]
[]
[]
[]
[]
[]
[]
[]
[]
[]
[]
[]
[]
[]
[]
[]
[]
[]
[]
[]
[]
[]
[]
[]
[]
[]
[]
[]
[]
[]
[]
[]
[]
[]
[]
[]
[]
[]
[]
[]
[]
[]
[]
[]
[]
[]
[]
[]
[]
[]
[]
[]
[]
[]
[]
[]
[]
[]
[]
[]
[]
[]
[]
[]
[]
[]
[]
[]
[]
[]
[]
[]
[]
[]
[]
[]
[]
[]
[]
[]
[]
[]
[]
[]
[]
[]
[]
[]
[]
[]
[]
[]
[]
[]
[]
[]
[]
[]
[]
[]
[]
[]
[]
[]
[]
[]
[]
[]
[]
[]
[]
[]
[]
[]
[]
[]
[]
[]
[]
[]
[]
[]
[]
[]
[]
[]
[]
[]
[]
[]
[]
[]
[]
[]
[]
[]
[]
[]
[]
[]
[]
[]
[]
[]
[]
[]
[]
[]
[]
[]
[]
[]
[]
[]
[]
[]
[]
[]
[]
[]
[]
[]
[]
[]
[]
[]
[]
[]
[]
[]
[]
[]
[]
[]
[]
[]
[]
[]
[]
[]
[]
[]
[]
[]
[]
[]
[]
[]
[]
[]
[]
[]
[]
[]
[]
[]
[]
[]
[]
[]
[]
[]
[]
[]
[]
[]
[]
[]
[]
[]
[]
[]
[]
[]
[]
[]
[]
[]
[]
[]
[]
[]
[]
[]
[]
[]
[]
[]
[]
[]
[]
[]
[]
[]
[]
[]
[]
[]
[]
[]
[]
[]
[]
[]
[]
[]
[]
[]
[]
[]
[]
[]
[]
[]
[]
[]
[]
[]
[]
[]
[]
[]
[]
[]
[]
[null,null,null,null,null,null,null,null,null,null,null,null,null,null,null,null,null,null,null,null,null,null,null,null,false]

{"sheet":"TechniquesE","index":6,"n_rows":1056,"n_cols":42,"rows_kept":1056,"cut":false,"hidden":false,"merged":[[70,6,70,7],[70,9,70,13],[70,15,70,19],[68,6,68,7],[68,9,68,13],[68,15,68,19],[69,6,69,7],[69,9,69,13],[69,15,69,19],[66,6,66,7],[66,9,66,13],[66,15,66,19],[67,6,67,7],[67,9,67,13],[67,15,67,19],[64,6,64,7],[64,9,64,13],[64,15,64,19],[65,6,65,7],[65,9,65,13],[65,15,65,19],[62,6,62,7],[62,9,62,13],[62,15,62,19],[63,6,63,7],[63,9,63,13],[63,15,63,19],[60,6,60,7],[60,9,60,13],[60,15,60,19],[61,6,61,7],[61,9,61,13],[61,15,61,19],[58,6,58,7],[58,9,58,13],[58,15,58,19],[59,6,59,7],[59,9,59,13],[59,15,59,19],[56,6,56,7],[56,9,56,13],[56,15,56,19],[57,6,57,7],[57,9,57,13],[57,15,57,19],[54,6,54,7],[54,9,54,13],[54,15,54,19],[55,6,55,7],[55,9,55,13],[55,15,55,19],[52,6,52,7],[52,9,52,13],[52,15,52,19],[53,6,53,7],[53,9,53,13],[53,15,53,19],[50,6,50,7],[50,9,50,13],[50,15,50,19],[51,6,51,7],[51,9,51,13],[51,15,51,19],[48,6,48,7],[48,9,48,13],[48,15,48,19],[49,6,49,7],[49,9,49,13],[49,15,49,19],[46,6,46,7],[46,9,46,13],[46,15,46,19],[47,6,47,7],[47,9,47,13],[47,15,47,19],[44,6,44,7],[44,9,44,13],[44,15,44,19],[45,6,45,7],[45,9,45,13],[45,15,45,19],[42,6,42,7],[42,9,42,13],[42,15,42,19],[43,6,43,7],[43,9,43,13],[43,15,43,19],[40,6,40,7],[40,9,40,13],[40,15,40,19],[41,6,41,7],[41,9,41,13],[41,15,41,19],[38,6,38,7],[38,9,38,13],[38,15,38,19],[39,6,39,7],[39,9,39,13],[39,15,39,19],[36,6,36,7],[36,9,36,13],[36,15,36,19],[37,6,37,7],[37,9,37,13],[37,15,37,19],[34,6,34,7],[34,9,34,13],[34,15,34,19],[35,6,35,7],[35,9,35,13],[35,15,35,19],[32,6,32,7],[32,9,32,13],[32,15,32,19],[33,6,33,7],[33,9,33,13],[33,15,33,19],[30,6,30,7],[30,9,30,13],[30,15,30,19],[31,6,31,7],[31,9,31,13],[31,15,31,19],[28,6,28,7],[28,9,28,13],[28,15,28,19],[29,6,29,7],[29,9,29,13],[29,15,29,19],[26,6,26,7],[26,9,26,13],[26,15,26,19],[27,6,27,7],[27,9,27,13],[27,15,27,19],[24,6,24,7],[24,9,24,13],[24,15,24,19],[25,6,25,7],[25,9,25,13],[25,15,25,19],[22,6,22,7],[22,9,22,13],[22,15,22,19],[23,6,23,7],[23,9,23,13],[23,15,23,19],[11,15,11,18],[12,16,12,18],[13,16,13,18],[16,15,16,18],[19,6,19,7],[21,6,21,7],[21,9,21,13],[21,15,21,19]]}
[]
[null,null,null,null,null,null,null,null,null,null,null,null,null,null,null,null,null,null,null,null,null,null,"Erreurs 1ers onglets:"]
[null,null,null,null,null,null,null,null,null,null,null,null,null,null,null,null,null,null,null,null,null,null,"Variante",{"$f":"Scenarios!X3","v":1}]
[null,null,null,null,null,null,null,null,null,null,null,null,null,null,null,null,null,null,null,null,null,null,"Acuueil",{"$f":"Accueil!W3","v":1}]
[null,null,null,null,null,null,null,null,null,null,null,null,null,null,null,null,null,null,null,null,null,null,"Descriptif site",{"$f":"'Descriptif site'!Z4","v":1}]
[null,null,null,null,null,null,null,null,null,null,null,null,null,null,null,null,null,null,null,null,null,null,"Choix techniques",{"$f":"TechniquesIS!$Z$20+TechniquesOS!$Z$20+TechniquesHS!Z20+TechniquesE!Z20","v":0},"Erreurs évaluations:"]
[null,null,null,null,null,null,null,null,null,null,null,null,null,null,null,null,null,null,null,null,null,null,null,{"$f":"SUM(X3:X6)","v":3},{"$f":"Accueil!X7","v":0}]
[]
[]
[]
[]
[]
[null,null,null,null,null,null,null,null,null,null,null,null,null,null,null,null,"Nombre de techniques à considérer:"]
[null,null,null,null,null,null,null,null,null,null,null,null,null,null,null,null,15]
[]
[null,null,null,null,false]
[]
[]
[null,null,null,null,null,null,null,null,null,null,null,null,null,null,null,null,null,null,null,null,null,null,null,null,{"$f":"IF(OR(Y20>10,Y20<2),1,0)","v":0}]
[null,null,null,"N°","Technique activée?",null,"Nom de la technique",null,null,"Description de la technique",null,null,null,null,null,"Justification",null,null,null,null,null,null,null,null,{"$f":"COUNTIF(Y22:Y28,TRUE)","v":7},{"$f":"COUNTIF(Z22:Z72,\"non completé\")","v":0}]
[null,null,null,null,null,null,null,null,null,null,null,null,null,null,null,null,null,null,null,null,null,null,null,null,null,null,null,null,null,null,null,null,null,null,null,null,null,null,null,null,null,0]
[null,null,null,"Technique 1",null,null,"E1",null,null,"Confinement physique",null,null,null,null,null,null,null,null,null,null,null,null,null,null,true,{"$f":"IF(AND(Y22=FALSE,P22=\"\"),\"non completé\", \"ok\")","v":"ok"}]
[null,null,null,"Technique 2",null,null,"E2",null,null,"Confinement hydraulique",null,null,null,null,null,null,null,null,null,null,null,null,null,null,true,{"$f":"IF(AND(Y23=FALSE,P23=\"\"),\"non completé\", \"ok\")","v":"ok"}]
[null,null,null,"Technique 3",null,null,"E3",null,null,"Pompage et traitement - Zone source",null,null,null,null,null,null,null,null,null,null,null,null,null,null,true,"ok"]
[null,null,null,"Technique 4",null,null,"E4",null,null,"Pompage et traitement - Fracturing",null,null,null,null,null,null,null,null,null,null,null,null,null,null,true,"ok"]
[null,null,null,"Technique 5",null,null,"E5",null,null,"GroundWater circulation wells",null,null,null,null,null,null,null,null,null,null,null,null,null,null,true,"ok"]
[null,null,null,"Technique 6",null,null,"E6",null,null,"Réduction chimique insitu",null,null,null,null,null,null,null,null,null,null,null,null,null,null,true,"ok"]
[null,null,null,"Technique 7",null,null,"E7",null,null,"Oxydation chimique insitu",null,null,null,null,null,null,null,null,null,null,null,null,null,null,true,"ok"]
[null,null,null,"Technique 8",null,null,"E8",null,null,"Lavage insitu (pompage et injection)",null,null,null,null,null,null,null,null,null,null,null,null,null,null,true,"ok"]
[null,null,null,"Technique 9",null,null,"E9",null,null,"Barrière perméable réactive",null,null,null,null,null,null,null,null,null,null,null,null,null,null,true,"ok"]
[null,null,null,"Technique 10",null,null,"E10",null,null,"Extraction multi-phases",null,null,null,null,null,null,null,null,null,null,null,null,null,null,true,"ok"]
[null,null,null,"Technique 11",null,null,"E11",null,null,"Désorption thermique",null,null,null,null,null,null,null,null,null,null,null,null,null,null,true,"ok"]
[null,null,null,"Technique 12",null,null,"E12",null,null,"Biosparing, in-well air stripping",null,null,null,null,null,null,null,null,null,null,null,null,null,null,true,"ok"]
[null,null,null,"Technique 13",null,null,"E13",null,null,"Biodégradation accélérée",null,null,null,null,null,null,null,null,null,null,null,null,null,null,true,"ok"]
[null,null,null,"Technique 14",null,null,"E14",null,null,"Atténuation naturelle contrôlée",null,null,null,null,null,null,null,null,null,null,null,null,null,null,true,"ok"]
[null,null,null,"Technique 15",null,null,"E15",null,null,"Phytoremediation",null,null,null,null,null,null,null,null,null,null,null,null,null,null,true,"ok"]
[null,null,null,"Technique 16",null,null,"E16",null,null,"Donnez une description…",null,null,null,null,null,null,null,null,null,null,null,null,null,null,true,{"$f":"IF(AND(Y37=FALSE,P37=\"\"),\"non completé\", \"ok\")","v":"ok"}]
[null,null,null,"Technique 17",null,null,"E17",null,null,"Donnez une description…",null,null,null,null,null,null,null,null,null,null,null,null,null,null,true,{"$f":"IF(AND(Y38=FALSE,P38=\"\"),\"non completé\", \"ok\")","v":"ok"}]
[null,null,null,"Technique 18",null,null,"E18",null,null,"Donnez une description…",null,null,null,null,null,null,null,null,null,null,null,null,null,null,true,"ok"]
[null,null,null,"Technique 19",null,null,"E19",null,null,"Donnez une description…",null,null,null,null,null,null,null,null,null,null,null,null,null,null,true,"ok"]
[null,null,null,"Technique 20",null,null,"E20",null,null,"Donnez une description…",null,null,null,null,null,null,null,null,null,null,null,null,null,null,true,"ok"]
[null,null,null,"Technique 21",null,null,"E21",null,null,"Donnez une description…",null,null,null,null,null,null,null,null,null,null,null,null,null,null,true,"ok"]
[null,null,null,"Technique 22",null,null,"E22",null,null,"Donnez une description…",null,null,null,null,null,null,null,null,null,null,null,null,null,null,true,"ok"]
[null,null,null,"Technique 23",null,null,"E23",null,null,"Donnez une description…",null,null,null,null,null,null,null,null,null,null,null,null,null,null,true,"ok"]
[null,null,null,"Technique 24",null,null,"E24",null,null,null,null,null,null,null,null,null,null,null,null,null,null,null,null,null,true,"ok"]
[null,null,null,"Technique 25",null,null,"E25",null,null,"Donnez une description…",null,null,null,null,null,null,null,null,null,null,null,null,null,null,true,"ok"]
[null,null,null,"Technique 26",null,null,"E26",null,null,"Donnez une description…",null,null,null,null,null,null,null,null,null,null,null,null,null,null,true,"ok"]
[null,null,null,"Technique 27",null,null,"E27",null,null,"Donnez une description…",null,null,null,null,null,null,null,null,null,null,null,null,null,null,true,"ok"]
[null,null,null,"Technique 28",null,null,"E28",null,null,"Donnez une description…",null,null,null,null,null,null,null,null,null,null,null,null,null,null,true,"ok"]
[null,null,null,"Technique 29",null,null,"E29",null,null,"Donnez une description…",null,null,null,null,null,null,null,null,null,null,null,null,null,null,true,"ok"]
[null,null,null,"Technique 30",null,null,"E30",null,null,"Donnez une description…",null,null,null,null,null,null,null,null,null,null,null,null,null,null,true,"ok"]
[null,null,null,"Technique 31",null,null,"E31",null,null,"Donnez une description…",null,null,null,null,null,null,null,null,null,null,null,null,null,null,true,{"$f":"IF(AND(Y52=FALSE,P52=\"\"),\"non completé\", \"ok\")","v":"ok"}]
[null,null,null,"Technique 32",null,null,"E32",null,null,"Donnez une description…",null,null,null,null,null,null,null,null,null,null,null,null,null,null,true,{"$f":"IF(AND(Y53=FALSE,P53=\"\"),\"non completé\", \"ok\")","v":"ok"}]
[null,null,null,"Technique 33",null,null,"E33",null,null,"Donnez une description…",null,null,null,null,null,null,null,null,null,null,null,null,null,null,true,"ok"]
[null,null,null,"Technique 34",null,null,"E34",null,null,"Donnez une description…",null,null,null,null,null,null,null,null,null,null,null,null,null,null,true,"ok"]
[null,null,null,"Technique 35",null,null,"E35",null,null,"Donnez une description…",null,null,null,null,null,null,null,null,null,null,null,null,null,null,true,"ok"]
[null,null,null,"Technique 36",null,null,"E36",null,null,"Donnez une description…",null,null,null,null,null,null,null,null,null,null,null,null,null,null,true,"ok"]
[null,null,null,"Technique 37",null,null,"E37",null,null,"Donnez une description…",null,null,null,null,null,null,null,null,null,null,null,null,null,null,true,"ok"]
[null,null,null,"Technique 38",null,null,"E38",null,null,"Donnez une description…",null,null,null,null,null,null,null,null,null,null,null,null,null,null,true,"ok"]
[null,null,null,"Technique 39",null,null,"E39",null,null,"Donnez une description…",null,null,null,null,null,null,null,null,null,null,null,null,null,null,true,"ok"]
[null,null,null,"Technique 40",null,null,"E40",null,null,"Donnez une description…",null,null,null,null,null,null,null,null,null,null,null,null,null,null,true,"ok"]
[null,null,null,"Technique 41",null,null,"E41",null,null,"Donnez une description…",null,null,null,null,null,null,null,null,null,null,null,null,null,null,true,"ok"]
[null,null,null,"Technique 42",null,null,"E42",null,null,"Donnez une description…",null,null,null,null,null,null,null,null,null,null,null,null,null,null,true,"ok"]
[null,null,null,"Technique 43",null,null,"E43",null,null,"Donnez une description…",null,null,null,null,null,null,null,null,null,null,null,null,null,null,true,"ok"]
[null,null,null,"Technique 44",null,null,"E44",null,null,"Donnez une description…",null,null,null,null,null,null,null,null,null,null,null,null,null,null,true,"ok"]
[null,null,null,"Technique 45",null,null,"E45",null,null,"Donnez une description…",null,null,null,null,null,null,null,null,null,null,null,null,null,null,true,"ok"]
[null,null,null,"Technique 46",null,null,"E46",null,null,"Donnez une description…",null,null,null,null,null,null,null,null,null,null,null,null,null,null,true,{"$f":"IF(AND(Y67=FALSE,P67=\"\"),\"non completé\", \"ok\")","v":"ok"}]
[null,null,null,"Technique 47",null,null,"E47",null,null,"Donnez une description…",null,null,null,null,null,null,null,null,null,null,null,null,null,null,true,{"$f":"IF(AND(Y68=FALSE,P68=\"\"),\"non completé\", \"ok\")","v":"ok"}]
[null,null,null,"Technique 48",null,null,"E48",null,null,"Donnez une description…",null,null,null,null,null,null,null,null,null,null,null,null,null,null,true,"ok"]
[null,null,null,"Technique 49",null,null,"E49",null,null,"Donnez une description…",null,null,null,null,null,null,null,null,null,null,null,null,null,null,true,"ok"]
[null,null,null,"Technique 50",null,null,"E50",null,null,"Donnez une description…",null,null,null,null,null,null,null,null,null,null,null,null,null,null,true,"ok"]
[]
[]
[]
[]
[]
[]
[]
[]
[]
[]
[]
[]
[]
[]
[]
[]
[]
[]
[]
[]
[]
[]
[]
[]
[]
[]
[]
[]
[]
[]
[]
[]
[]
[]
[]
[]
[]
[]
[]
[]
[]
[]
[]
[]
[]
[]
[]
[]
[]
[]
[]
[]
[]
[]
[]
[]
[]
[]
[]
[]
[]
[]
[]
[]
[]
[]
[]
[]
[]
[]
[]
[]
[]
[]
[]
[]
[]
[]
[]
[]
[]
[]
[]
[]
[]
[]
[]
[]
[]
[]
[]
[]
[]
[]
[]
[]
[]
[]
[]
[]
[]
[]
[]
[]
[]
[]
[]
[]
[]
[]
[]
[]
[]
[]
[]
[]
[]
[]
[]
[]
[]
[]
[]
[]
[]
[]
[]
[]
[]
[]
[]
[]
[]
[]
[]
[]
[]
[]
[]
[]
[]
[]
[]
[]
[]
[]
[]
[]
[]
[]
[]
[]
[]
[]
[]
[]
[]
[]
[]
[]
[]
[]
[]
[]
[]
[]
[]
[]
[]
[]
[]
[]
[]
[]
[]
[]
[]
[]
[]
[]
[]
[]
[]
[]
[]
[]
[]
[]
[]
[]
[]
[]
[]
[]
[]
[]
[]
[]
[]
[]
[]
[]
[]
[]
[]
[]
[]
[]
[]
[]
[]
[]
[]
[]
[]
[]
[]
[]
[]
[]
[]
[]
[]
[]
[]
[]
[]
[]
[]
[]
[]
[]
[]
[]
[]
[]
[]
[]
[]
[]
[]
[]
[]
[]
[]
[]
[]
[]
[]
[]
[]
[]
[]
[]
[]
[]
[]
[]
[]
[]
[]
[]
[]
[]
[]
[]
[]
[]
[]
[]
[]
[]
[]
[]
[]
[]
[]
[]
[]
[]
[]
[]
[]
[]
[]
[]
[]
[]
[]
[]
[]
[]
[]
[]
[]
[]
[]
[]
[]
[]
[]
[]
[]
[]
[]
[]
[]
[]
[]
[]
[]
[]
[]
[]
[]
[]
[]
[]
[]
[]
[]
[]
[]
[]
[]
[]
[]
[]
[]
[]
[]
[]
[]
[]
[]
[]
[]
[]
[]
[]
[]
[]
[]
[]
[]
[]
[]
[]
[]
[]
[]
[]
[]
[]
[]
[]
[]
[]
[]
[]
[]
[]
[]
[]
[]
[]
[]
[]
[]
[]
[]
[]
[]
[]
[]
[]
[]
[]
[]
[]
[]
[]
[]
[]
[]
[]
[]
[]
[]
[]
[]
[]
[]
[]
[]
[]
[]
[]
[]
[]
[]
[]
[]
[]
[]
[]
[]
[]
[]
[]
[]
[]
[]
[]
[]
[]
[]
[]
[]
[]
[]
[]
[]
[]
[]
[]
[]
[]
[]
[]
[]
[]
[]
[]
[]
[]
[]
[]
[]
[]
[]
[]
[]
[]
[]
[]
[]
[]
[]
[]
[]
[]
[]
[]
[]
[]
[]
[]
[]
[]
[]
[]
[]
[]
[]
[]
[]
[]
[]
[]
[]
[]
[]
[]
[]
[]
[]
[]
[]
[]
[]
[]
[]
[]
[]
[]
[]
[]
[]
[]
[]
[]
[]
[]
[]
[]
[]
[]
[]
[]
[]
[]
[]
[]
[]
[]
[]
[]
[]
[]
[]
[]
[]
[]
[]
[]
[]
[]
[]
[]
[]
[]
[]
[]
[]
[]
[]
[]
[]
[]
[]
[]
[]
[]
[]
[]
[]
[]
[]
[]
[]
[]
[]
[]
[]
[]
[]
[]
[]
[]
[]
[]
[]
[]
[]
[]
[]
[]
[]
[]
[]
[]
[]
[]
[]
[]
[]
[]
[]
[]
[]
[]
[]
[]
[]
[]
[]
[]
[]
[]
[]
[]
[]
[]
[]
[]
[]
[]
[]
[]
[]
[]
[]
[]
[]
[]
[]
[]
[]
[]
[]
[]
[]
[]
[]
[]
[]
[]
[]
[]
[]
[]
[]
[]
[]
[]
[]
[]
[]
[]
[]
[]
[]
[]
[]
[]
[]
[]
[]
[]
[]
[]
[]
[]
[]
[]
[]
[]
[]
[]
[]
[]
[]
[]
[]
[]
[]
[]
[]
[]
[]
[]
[]
[]
[]
[]
[]
[]
[]
[]
[]
[]
[]
[]
[]
[]
[]
[]
[]
[]
[]
[]
[]
[]
[]
[]
[]
[]
[]
[]
[]
[]
[]
[]
[]
[]
[]
[]
[]
[]
[]
[]
[]
[]
[]
[]
[]
[]
[]
[]
[]
[]
[]
[]
[]
[]
[]
[]
[]
[]
[]
[]
[]
[]
[]
[]
[]
[]
[]
[]
[]
[]
[]
[]
[]
[]
[]
[]
[]
[]
[]
[]
[]
[]
[]
[]
[]
[]
[]
[]
[]
[]
[]
[]
[]
[]
[]
[]
[]
[]
[]
[]
[]
[]
[]
[]
[]
[]
[]
[]
[]
[]
[]
[]
[]
[]
[]
[]
[]
[]
[]
[]
[]
[]
[]
[]
[]
[]
[]
[]
[]
[]
[]
[]
[]
[]
[]
[]
[]
[]
[]
[]
[]
[]
[]
[]
[]
[]
[]
[]
[]
[]
[]
[]
[]
[]
[]
[]
[]
[]
[]
[]
[]
[]
[]
[]
[]
[]
[]
[]
[]
[]
[]
[]
[]
[]
[]
[]
[]
[]
[]
[]
[]
[]
[]
[]
[]
[]
[]
[]
[]
[]
[]
[]
[]
[]
[]
[]
[]
[]
[]
[]
[]
[]
[]
[]
[]
[]
[]
[]
[]
[]
[]
[]
[]
[]
[]
[]
[]
[]
[]
[]
[]
[]
[]
[]
[]
[]
[]
[]
[]
[]
[]
[]
[]
[]
[]
[]
[]
[]
[]
[]
[]
[]
[]
[]
[]
[]
[]
[]
[]
[]
[]
[]
[]
[]
[]
[]
[]
[]
[]
[]
[]
[]
[]
[]
[]
[]
[]
[]
[]
[]
[]
[]
[]
[]
[]
[]
[]
[]
[]
[]
[]
[]
[]
[]
[]
[]
[]
[]
[]
[]
[]
[]
[]
[]
[]
[]
[]
[]
[]
[]
[]
[]
[]
[]
[]
[]
[]
[]
[]
[]
[]
[]
[]
[]
[]
[]
[]
[]
[]
[]
[]
[]
[]
[]
[]
[]
[]
[]
[]
[]
[]
[]
[null,null,null,null,null,null,null,null,null,null,null,null,null,null,null,null,null,null,null,null,null,null,null,null,false]

{"sheet":"Scenarios","index":7,"n_rows":55,"n_cols":32,"rows_kept":55,"cut":false,"hidden":false,"merged":[[31,9,32,19],[33,9,34,19],[29,6,30,7],[21,9,22,19],[23,9,24,19],[25,9,26,19],[27,9,28,19],[29,9,30,19],[39,3,40,3],[21,3,22,3],[23,3,24,3],[25,3,26,3],[27,3,28,3],[29,3,30,3],[31,3,32,3],[33,3,34,3],[35,3,36,3],[37,3,38,3],[11,15,11,18],[12,15,12,18],[13,15,13,18],[14,15,14,18],[15,15,15,18],[41,6,41,7],[41,9,41,13],[16,15,16,18],[31,6,32,7],[33,6,34,7],[35,6,36,7],[37,6,38,7],[35,9,36,19],[37,9,38,19],[39,9,40,19],[19,6,19,7],[21,6,22,7],[23,6,24,7],[39,6,40,7],[25,6,26,7],[27,6,28,7]]}
[null,null,null,null,null,null,null,null,null,null,null,null,null,null,null,null,null,null,null,null,null,null,"n/a","n/a","n/a","n/a","n/a","n/a","n/a","n/a","n/a","n/a"]
[null,null,null,null,null,null,null,null,null,null,null,null,null,null,null,null,null,null,null,null,null,null,"n/a","n/a","n/a","n/a","n/a","n/a","n/a","n/a","n/a","n/a"]
[null,null,null,null,null,null,null,null,null,null,null,null,null,null,null,null,null,null,null,null,null,null,"Variantes",{"$f":"Y19+Z20","v":1}]
[null,null,null,null,null,null,null,null,null,null,null,null,null,null,null,null,null,null,null,null,null,null,"Acuueil",{"$f":"Accueil!W3","v":1}]
[null,null,null,null,null,null,null,null,null,null,null,null,null,null,null,null,null,null,null,null,null,null,"Descriptif site",{"$f":"'Descriptif site'!Z4","v":1}]
[null,null,null,null,null,null,null,null,null,null,null,null,null,null,null,null,null,null,null,null,null,null,"Choix techniques",{"$f":"IF(AND(Y19=0,Z20=0),0,1)","v":1},null,{"$f":"X7","v":4}]
[null,null,null,null,null,null,null,null,null,null,null,null,null,null,null,null,null,null,null,null,null,null,null,{"$f":"SUM(X3:X6)","v":4},{"$f":"Accueil!X7","v":0}]
[]
[]
[]
[]
[]
[]
[]
[]
[null,null,null,null,false]
[]
[]
[null,null,null,null,null,null,null,null,null,null,null,null,null,null,null,null,null,null,null,null,null,null,"maxvar",null,{"$f":"IF(OR(Y20>10,Y20<3),1,0)","v":1}]
[null,null,null,"N°","Variante activée?",null,"Nom de la variante",null,null,"Description de la variante (limite 200 caractères)",null,null,null,null,null,null,null,null,null,null,null,null,{"$f":"MAX(W22:W40)","v":0},null,{"$f":"COUNTIF(Y22:Y40,TRUE)","v":0},{"$f":"COUNTIF(Z22:Z40,\"non completé\")","v":0}]
[]
[null,null,null,"Variante 1",null,null,null,null,null,null,null,null,null,null,null,null,null,null,null,null,null,{"$f":"IF(Y22=FALSE,\"\",G22)","v":""},{"$f":"IF(Y22=TRUE,X22,\"\")","v":""},1,false,{"$f":"IF(Y22=TRUE,IF(OR(G22=\"\",J22=\"\"),\"non completé\", \"ok\"))","v":false},{"$f":"COUNTIF(W$22:W22,\"<\"&X22)","v":0}]
[null,null,null,null,null,null,null,null,null,null,null,null,null,null,null,null,null,null,null,null,null,null,{"$f":"IF(Y23=TRUE,X23,\"\")","v":""},null,null,null,{"$f":"COUNTIF(W$22:W23,\"<\"&X23)","v":0}]
[null,null,null,"Variante 2",null,null,null,null,null,null,null,null,null,null,null,null,null,null,null,null,null,{"$f":"IF(Y24=FALSE,\"\",G24)","v":""},"",2,false,{"$f":"IF(Y24=TRUE,IF(OR(G24=\"\",J24=\"\"),\"non completé\", \"ok\"))","v":false},{"$f":"COUNTIF(W$22:W24,\"<\"&X24)","v":0}]
[null,null,null,null,null,null,null,null,null,null,null,null,null,null,null,null,null,null,null,null,null,null,"",null,null,null,{"$f":"COUNTIF(W$22:W25,\"<\"&X25)","v":0}]
[null,null,null,"Variante 3",null,null,null,null,null,null,null,null,null,null,null,null,null,null,null,null,null,{"$f":"IF(Y26=FALSE,\"\",G26)","v":""},"",3,false,{"$f":"IF(Y26=TRUE,IF(OR(G26=\"\",J26=\"\"),\"non completé\", \"ok\"))","v":false},{"$f":"COUNTIF(W$22:W26,\"<\"&X26)","v":0}]
[null,null,null,null,null,null,null,null,null,null,null,null,null,null,null,null,null,null,null,null,null,null,"",null,null,null,{"$f":"COUNTIF(W$22:W27,\"<\"&X27)","v":0}]
[null,null,null,"Variante 4",null,null,null,null,null,null,null,null,null,null,null,null,null,null,null,null,null,{"$f":"IF(Y28=FALSE,\"\",G28)","v":""},"",4,false,{"$f":"IF(Y28=TRUE,IF(OR(G28=\"\",J28=\"\"),\"non completé\", \"ok\"))","v":false},{"$f":"COUNTIF(W$22:W28,\"<\"&X28)","v":0}]
[null,null,null,null,null,null,null,null,null,null,null,null,null,null,null,null,null,null,null,null,null,{"$f":"IF(Y29=FALSE,\"\",G29)","v":""},"",null,null,null,{"$f":"COUNTIF(W$22:W29,\"<\"&X29)","v":0}]
[null,null,null,"Variante 5",null,null,null,null,null,null,null,null,null,null,null,null,null,null,null,null,null,"","",5,false,{"$f":"IF(Y30=TRUE,IF(OR(G30=\"\",J30=\"\"),\"non completé\", \"ok\"))","v":false},{"$f":"COUNTIF(W$22:W30,\"<\"&X30)","v":0}]
[null,null,null,null,null,null,null,null,null,null,null,null,null,null,null,null,null,null,null,null,null,"","",null,null,null,{"$f":"COUNTIF(W$22:W31,\"<\"&X31)","v":0}]
[null,null,null,"Variante 6",null,null,null,null,null,null,null,null,null,null,null,null,null,null,null,null,null,"","",6,false,{"$f":"IF(Y32=TRUE,IF(OR(G32=\"\",J32=\"\"),\"non completé\", \"ok\"))","v":false},{"$f":"COUNTIF(W$22:W32,\"<\"&X32)","v":0}]
[null,null,null,null,null,null,null,null,null,null,null,null,null,null,null,null,null,null,null,null,null,"","",null,null,null,{"$f":"COUNTIF(W$22:W33,\"<\"&X33)","v":0}]
[null,null,null,"Variante 7",null,null,null,null,null,null,null,null,null,null,null,null,null,null,null,null,null,"","",7,false,{"$f":"IF(Y34=TRUE,IF(OR(G34=\"\",J34=\"\"),\"non completé\", \"ok\"))","v":false},{"$f":"COUNTIF(W$22:W34,\"<\"&X34)","v":0}]
[null,null,null,null,null,null,null,null,null,null,null,null,null,null,null,null,null,null,null,null,null,"","",null,null,null,{"$f":"COUNTIF(W$22:W35,\"<\"&X35)","v":0}]
[null,null,null,"Variante 8",null,null,null,null,null,null,null,null,null,null,null,null,null,null,null,null,null,"","",8,false,{"$f":"IF(Y36=TRUE,IF(OR(G36=\"\",J36=\"\"),\"non completé\", \"ok\"))","v":false},{"$f":"COUNTIF(W$22:W36,\"<\"&X36)","v":0}]
[null,null,null,null,null,null,null,null,null,null,null,null,null,null,null,null,null,null,null,null,null,"","",null,null,null,{"$f":"COUNTIF(W$22:W37,\"<\"&X37)","v":0}]
[null,null,null,"Variante 9",null,null,null,null,null,null,null,null,null,null,null,null,null,null,null,null,null,"","",9,false,{"$f":"IF(Y38=TRUE,IF(OR(G38=\"\",J38=\"\"),\"non completé\", \"ok\"))","v":false},{"$f":"COUNTIF(W$22:W38,\"<\"&X38)","v":0}]
[null,null,null,null,null,null,null,null,null,null,null,null,null,null,null,null,null,null,null,null,null,"","",null,null,null,{"$f":"COUNTIF(W$22:W39,\"<\"&X39)","v":0}]
[null,null,null,"Variante 10",null,null,null,null,null,null,null,null,null,null,null,null,null,null,null,null,null,"","",10,false,{"$f":"IF(Y40=TRUE,IF(OR(G40=\"\",J40=\"\"),\"non completé\", \"ok\"))","v":false},{"$f":"COUNTIF(W$22:W40,\"<\"&X40)","v":0}]
[null,null,null,null,null,null,null,null,null,null,null,null,null,null,null,null,null,null,null,null,null,""]
[null,null,null,null,null,null,null,null,null,null,null,null,null,null,null,null,null,null,null,null,null,""]
[]
[]
[]
[]
[]
[]
[]
[]
[]
[]
[]
[null,null,null,"Activé"]
[null,null,null,"Désactivé"]

{"sheet":"Eval_cout","index":8,"n_rows":37,"n_cols":42,"rows_kept":37,"cut":false,"hidden":false,"merged":[[11,12,15,12]]}
[null,2,3,4,5,8,9,10,11,12,13,14,15,16,17,18,19,20,null,22,"Coût","Cout de fonctionnement","Cout des mesures complémentaires et compensatoires (mesure de réparation)","Environnement (local)","Cout d’investissement","Cout de mesures de sécurité et de suivi","Coûts lié à la persistance de pollutions résiduelles et usage du terrain","n/a","n/a","n/a",33]
[]
[]
[]
[]
[]
[]
[]
[]
[]
[]
[null,null,null,null,null,null,null,null,null,null,null,null,null,null,null,"Vérifie le poids des critères"]
[null,null,null,null,null,null,null,null,null,null,null,null,null,null,null,"Vérifie les cellules désactivés"]
[null,null,null,null,null,null,null,null,null,null,null,null,null,null,null,"Vérifie les cellules activés",{"$f":"IF(ISNUMBER(SEARCH(\"pasvalscénarioact\",CONCATENATE(G18,H18,I18,J18,K18,L18,M18,#REF!,#REF!,#REF!))),1,0)","v":0},{"$f":"IF(Q14=1, \"Attention! Vous n'avez pas attribué toutes les valeurs à tous les scénarios activés!\",\"\")","v":""}]
[null,null,null,null,null,null,null,null,null,null,null,null,null,null,null,null,"Max"]
[null,null,null,null,null,null,null,null,null,null,null,null,null,null,null,null,"Min"]
[]
[null,null,null,null,null,null,{"$f":"IF(AND(COUNTA(H22:H32,#REF!,#REF!,#REF!,#REF!,#REF!)<35,H20=1),\"pasvalscénarioact\",\"ok\")","v":"pasvalscénarioact"},{"$f":"IF(AND(COUNTA(I22:I32,#REF!,#REF!,#REF!,#REF!,#REF!)<35,I20=1),\"pasvalscénarioact\",\"ok\")","v":"ok"},{"$f":"IF(AND(COUNTA(J22:J32,#REF!,#REF!,#REF!,#REF!,#REF!)<35,J20=1),\"pasvalscénarioact\",\"ok\")","v":"ok"},{"$f":"IF(AND(COUNTA(K22:K32,#REF!,#REF!,#REF!,#REF!,#REF!)<35,K20=1),\"pasvalscénarioact\",\"ok\")","v":"ok"},{"$f":"IF(AND(COUNTA(L22:L32,#REF!,#REF!,#REF!,#REF!,#REF!)<35,L20=1),\"pasvalscénarioact\",\"ok\")","v":"ok"},{"$f":"IF(AND(COUNTA(M22:M32,#REF!,#REF!,#REF!,#REF!,#REF!)<35,M20=1),\"pasvalscénarioact\",\"ok\")","v":"ok"},{"$f":"IF(AND(COUNTA(#REF!,#REF!,#REF!,#REF!,#REF!,#REF!)<35,#REF!=1),\"pasvalscénarioact\",\"ok\")","v":{"$error":"#REF!"}},null,null,null,null,null,null,{"$f":"COUNTIF(H22:Q37,\"champ calculé\")","v":0},{"$f":"Accueil!X7","v":0},null,null,null,null,null,null,null,null,null,null,"verification",{"$f":"SUM(AF21,#REF!,#REF!,#REF!,#REF!)","v":{"$error":"#REF!"}}]
[null,null,null,"Catégorie/Indicateur",null,"Max /Min","Unité",{"$f":"Scenarios!W1","v":"n/a"},{"$f":"Scenarios!X1","v":"n/a"},{"$f":"Scenarios!Y1","v":"n/a"},{"$f":"Scenarios!Z1","v":"n/a"},{"$f":"Scenarios!AA1","v":"n/a"},{"$f":"Scenarios!AB1","v":"n/a"},{"$f":"Scenarios!AC1","v":"n/a"},{"$f":"Scenarios!AD1","v":"n/a"},{"$f":"Scenarios!AE1","v":"n/a"},{"$f":"Scenarios!AF1","v":"n/a"},null,null,"rows","columns"]
[null,null,null,null,null,null,null,{"$f":"Scenarios!X22","v":1},{"$f":"Scenarios!X24","v":2},{"$f":"Scenarios!X26","v":3},{"$f":"Scenarios!X28","v":4},{"$f":"Scenarios!X30","v":5},{"$f":"Scenarios!X32","v":6},{"$f":"Scenarios!X40","v":10},null,null,null,null,null,{"$f":"COUNTIF(T22:T31,\"<>n/a\")","v":10},{"$f":"COUNTIF(U21:AD21,\"<>n/a\"\n)","v":0}]
[null,null,null,"Coût",null,null,null,null,null,null,null,null,null,null,null,null,null,null,null,{"$f":"D21","v":"Coût"},{"$f":"H19","v":"n/a"},"n/a","n/a","n/a","n/a","n/a","n/a","n/a","n/a","n/a",null,{"$f":"COUNTIF(AG22:AP36,\"not ok\")","v":0},{"$f":"U21","v":"n/a"},{"$f":"V21","v":"n/a"},"n/a","n/a","n/a","n/a","n/a","n/a","n/a","n/a"]
[null,null,null,"Coût d’investissement et de fonctionnement",null,"Min","K€",{"$f":"IF(OR(H$19=\"n/a\",$S22=FALSE),0,IF(COUNTA(H23:H26)<4,\"champ calculé\",SUM(H23:H26)))","v":0},{"$f":"IF(OR(I$19=\"n/a\",$S22=FALSE),0,IF(COUNTA(I23:I26)<4,\"champ calculé\",SUM(I23:I26)))","v":0},{"$f":"IF(OR(J$19=\"n/a\",$S22=FALSE),0,IF(COUNTA(J23:J26)<4,\"champ calculé\",SUM(J23:J26)))","v":0},0,0,0,0,0,0,0,null,true,"FALSE",null,null,null,null,null,null,null,null,null,null,null,{"$f":"S22","v":true},{"$f":"IF(ISBLANK(H22), IF( OR(AG$21=\"n/a\",$AF22=FALSE,$AF22=0),\"ok\",\"not ok\"),\"ok\")","v":"ok"},"ok","ok","ok","ok","ok","ok","ok","ok","ok"]
[null,null,null,"Etude préalable",null,null,"K€",null,null,null,null,null,null,null,null,null,null,null,{"$f":"S$22","v":true},{"$f":"S23","v":true}]
[null,null,null,"OPEX",null,null,"K€",null,null,null,null,null,null,null,null,null,null,null,{"$f":"S$22","v":true},{"$f":"S24","v":true}]
[null,null,null,"CAPEX",null,null,"K€",null,null,null,null,null,null,null,null,null,null,null,true,true]
[null,null,null,"Suivi",null,null,"K€",null,null,null,null,null,null,null,null,null,null,null,true,true]
[null,null,null,null,null,null,null,null,null,null,null,null,null,null,null,null,null,null,null,0,null,null,null,null,null,null,null,null,null,null,null,{"$f":"S27","v":0},{"$f":"IF(ISBLANK(H27), IF( OR(AG$21=\"n/a\",$AF27=FALSE,$AF27=0),\"ok\",\"not ok\"),\"ok\")","v":"ok"},{"$f":"IF(ISBLANK(I27), IF( OR(AH$21=\"n/a\",$AF27=FALSE,$AF27=0),\"ok\",\"not ok\"),\"ok\")","v":"ok"},"ok","ok","ok","ok","ok","ok","ok","ok"]
[null,null,null,"Coût de mesures de sécurité et de suivi",null,"Min","K€",{"$f":"IF(OR(H19=\"n/a\",$S28=FALSE),\"\",IF(COUNTA(H29:H30)<2,\"champ calculé\",SUM(H29:H30)))","v":""},"","","","","","","","","",null,false,"FALSE",null,null,null,null,null,null,null,null,null,null,null,{"$f":"S28","v":false},"ok","ok","ok","ok","ok","ok","ok","ok","ok","ok"]
[null,null,null,"Coûts de suivi post-traitement actif ",null,null,"K€",null,null,null,null,null,null,null,null,null,null,null,{"$f":"S$28","v":false},false]
[null,null,null,"Coûts de mise en sécurité",null,null,"K€",null,null,null,null,null,null,null,null,null,null,null,{"$f":"S$28","v":false},false]
[null,null,null,null,null,null,null,null,null,null,null,null,null,null,null,null,null,null,null,0,null,null,null,null,null,null,null,null,null,null,null,{"$f":"S31","v":0},"ok","ok","ok","ok","ok","ok","ok","ok","ok","ok"]
[null,null,null,"Coût des mesures complémentaires et compensatoires",null,"Min","K€",{"$f":"IF(OR(H19=\"n/a\",$S32=FALSE),\"\",IF(COUNTA(H33:H34)<2,\"champ calculé\",SUM(H33:H34)))","v":""},"","","","","","","","","",null,false,"FALSE",null,null,null,null,null,null,null,null,null,null,null,{"$f":"S32","v":false},"ok","ok","ok","ok","ok","ok","ok","ok","ok","ok"]
[null,null,null,"Coût des mesures complémentaires",null,null,"K€",null,null,null,null,null,null,null,null,null,null,null,{"$f":"S$32","v":false},false]
[null,null,null,"Coût des mesures compensatoires",null,null,"K€",null,null,null,null,null,null,null,null,null,null,null,{"$f":"S$32","v":false},false]
[null,null,null,null,null,null,null,null,null,null,null,null,null,null,null,null,null,null,null,0,null,null,null,null,null,null,null,null,null,null,null,{"$f":"S35","v":0},"ok","ok","ok","ok","ok","ok","ok","ok","ok","ok"]
[null,null,null,"Coûts lié à la persistance de pollutions résiduelles et usage du terrain",null,"Min","K€",{"$f":"IF(OR(H19=\"n/a\",$S36=FALSE),\"\",IF(COUNTA(H37:H37)<1,\"champ calculé\",H37))","v":""},{"$f":"IF(OR(I19=\"n/a\",$S36=FALSE),\"\",IF(COUNTA(I37:I37)<1,\"champ calculé\",I37))","v":""},"","","","","","","","",null,false,"FALSE",null,null,null,null,null,null,null,null,null,null,null,{"$f":"S36","v":false},"ok","ok","ok","ok","ok","ok","ok","ok","ok","ok"]
[null,null,null,"Coûts de traitement",null,null,"K€",null,null,null,null,null,null,null,null,null,null,null,{"$f":"S$36","v":false},false]

{"sheet":"Eval_env","index":9,"n_rows":71,"n_cols":42,"rows_kept":71,"cut":false,"hidden":false,"merged":[[11,12,15,12]]}
[null,2,3,4,5,8,9,10,11,12,13,14,15,16,17,18,19,20,null,22,"Coût","Cout de fonctionnement","Cout des mesures complémentaires et compensatoires (mesure de réparation)","Environnement (local)","Cout d’investissement","Cout de mesures de sécurité et de suivi","Persistance de pollutions résiduelles et usage du terrain","n/a","n/a","n/a",33]
[]
[]
[]
[]
[]
[]
[]
[]
[]
[]
[null,null,null,null,null,null,null,null,null,null,null,null,null,null,null,"Vérifie le poids des critères"]
[null,null,null,null,null,null,null,null,null,null,null,null,null,null,null,"Vérifie les cellules désactivés"]
[null,null,null,null,null,null,null,null,null,null,null,null,null,null,null,"Vérifie les cellules activés",{"$f":"IF(ISNUMBER(SEARCH(\"pasvalscénarioact\",CONCATENATE(G18,H18,I18,J18,K18,L18,M18,#REF!,#REF!,#REF!))),1,0)","v":0},{"$f":"IF(Q14=1, \"Attention! Vous n'avez pas attribué toutes les valeurs à tous les scénarios activés!\",\"\")","v":""}]
[null,null,null,null,null,null,null,null,null,null,null,null,null,null,null,null,"Max"]
[null,null,null,null,null,null,null,null,null,null,null,null,null,null,null,null,"Min"]
[]
[null,null,null,null,null,null,{"$f":"IF(AND(COUNTA(H22:H32,#REF!,#REF!,#REF!,#REF!,#REF!)<35,H20=1),\"pasvalscénarioact\",\"ok\")","v":"pasvalscénarioact"},{"$f":"IF(AND(COUNTA(I22:I32,#REF!,#REF!,#REF!,#REF!,#REF!)<35,I20=1),\"pasvalscénarioact\",\"ok\")","v":"ok"},{"$f":"IF(AND(COUNTA(J22:J32,#REF!,#REF!,#REF!,#REF!,#REF!)<35,J20=1),\"pasvalscénarioact\",\"ok\")","v":"ok"},{"$f":"IF(AND(COUNTA(K22:K32,#REF!,#REF!,#REF!,#REF!,#REF!)<35,K20=1),\"pasvalscénarioact\",\"ok\")","v":"ok"},{"$f":"IF(AND(COUNTA(L22:L32,#REF!,#REF!,#REF!,#REF!,#REF!)<35,L20=1),\"pasvalscénarioact\",\"ok\")","v":"ok"},{"$f":"IF(AND(COUNTA(M22:M32,#REF!,#REF!,#REF!,#REF!,#REF!)<35,M20=1),\"pasvalscénarioact\",\"ok\")","v":"ok"},{"$f":"IF(AND(COUNTA(#REF!,#REF!,#REF!,#REF!,#REF!,#REF!)<35,#REF!=1),\"pasvalscénarioact\",\"ok\")","v":{"$error":"#REF!"}},null,null,null,null,null,null,{"$f":"COUNTIF(H22:Q70,\"champ calculé\")","v":0},{"$f":"Accueil!X7","v":0},null,null,null,null,null,null,null,null,null,null,"verification",{"$f":"SUM(AF21,#REF!,#REF!,#REF!,#REF!)","v":{"$error":"#REF!"}}]
[null,null,null,"Catégorie/Indicateur",null,"Max /Min","Unité",{"$f":"Scenarios!W1","v":"n/a"},{"$f":"Scenarios!X1","v":"n/a"},{"$f":"Scenarios!Y1","v":"n/a"},{"$f":"Scenarios!Z1","v":"n/a"},{"$f":"Scenarios!AA1","v":"n/a"},{"$f":"Scenarios!AB1","v":"n/a"},{"$f":"Scenarios!AC1","v":"n/a"},{"$f":"Scenarios!AD1","v":"n/a"},{"$f":"Scenarios!AE1","v":"n/a"},{"$f":"Scenarios!AF1","v":"n/a"},null,null,"rows","columns"]
[null,null,null,null,null,null,null,{"$f":"Scenarios!X22","v":1},{"$f":"Scenarios!X24","v":2},{"$f":"Scenarios!X26","v":3},{"$f":"Scenarios!X28","v":4},{"$f":"Scenarios!X30","v":5},{"$f":"Scenarios!X32","v":6},{"$f":"Scenarios!X40","v":10},null,null,null,null,null,{"$f":"COUNTIF(T22:T32,\"<>n/a\")","v":11},{"$f":"COUNTIF(U21:AD21,\"<>n/a\"\n)","v":0}]
[null,null,null,"Environnement (local)",null,null,null,null,null,null,null,null,null,null,null,null,null,null,null,{"$f":"D21","v":"Environnement (local)"},{"$f":"H19","v":"n/a"},"n/a","n/a","n/a","n/a","n/a","n/a","n/a","n/a","n/a",null,{"$f":"COUNTIF(AG22:AP33,\"not ok\")","v":0},{"$f":"U21","v":"n/a"},{"$f":"V21","v":"n/a"},"n/a","n/a","n/a","n/a","n/a","n/a","n/a","n/a"]
[null,null,null,"Cote liée au pourcentage de charge polluante éliminée",null,"Min","N/A",{"$f":"IF(OR(H19=\"n/a\",$S22=FALSE),\"\",IF(COUNTA(H24:H26)<3,\"champ calculé\",H24/H25*IF(H26=\"oui\",3,1)))","v":""},{"$f":"IF(OR(I19=\"n/a\",$S22=FALSE),\"\",IF(COUNTA(I24:I26)<3,\"champ calculé\",I24/I25*IF(I26=\"oui\",3,1)))","v":""},{"$f":"IF(OR(J19=\"n/a\",$S22=FALSE),\"\",IF(COUNTA(J24:J26)<3,\"champ calculé\",J24/J25*IF(J26=\"oui\",3,1)))","v":""},"","","","","","","",null,true,null,null,null,null,null,null,null,null,null,false,null,null,{"$f":"S22","v":true},{"$f":"IF(ISBLANK(H22), IF( OR(AG$21=\"n/a\",$AF22=FALSE,$AF22=0),\"ok\",\"not ok\"),\"ok\")","v":"ok"},{"$f":"IF(ISBLANK(I22), IF( OR(AH$21=\"n/a\",$AF22=FALSE,$AF22=0),\"ok\",\"not ok\"),\"ok\")","v":"ok"},"ok","ok","ok","ok","ok","ok","ok","ok"]
[null,null,null,"Pourcentage de charge polluante éliminée",null,null,"%",{"$f":"IF(OR(H19=\"n/a\",$S22=FALSE),\"\",IF(COUNTA(H24:H25)<2,\"champ calculé\",H25/H24))","v":""},"","","","","","","","","",null,{"$f":"S22","v":true},null,null,null,null,null,null,null,null,null,false,null,null,{"$f":"S23","v":true},{"$f":"IF(ISBLANK(H23), IF( OR(AG$21=\"n/a\",$AF23=FALSE,$AF23=0),\"ok\",\"not ok\"),\"ok\")","v":"ok"},{"$f":"IF(ISBLANK(I23), IF( OR(AH$21=\"n/a\",$AF23=FALSE,$AF23=0),\"ok\",\"not ok\"),\"ok\")","v":"ok"},{"$f":"IF(ISBLANK(J23), IF( OR(AI$21=\"n/a\",$AF23=FALSE,$AF23=0),\"ok\",\"not ok\"),\"ok\")","v":"ok"},{"$f":"IF(ISBLANK(K23), IF( OR(AJ$21=\"n/a\",$AF23=FALSE,$AF23=0),\"ok\",\"not ok\"),\"ok\")","v":"ok"},{"$f":"IF(ISBLANK(L23), IF( OR(AK$21=\"n/a\",$AF23=FALSE,$AF23=0),\"ok\",\"not ok\"),\"ok\")","v":"ok"},{"$f":"IF(ISBLANK(M23), IF( OR(AL$21=\"n/a\",$AF23=FALSE,$AF23=0),\"ok\",\"not ok\"),\"ok\")","v":"ok"},{"$f":"IF(ISBLANK(N23), IF( OR(AM$21=\"n/a\",$AF23=FALSE,$AF23=0),\"ok\",\"not ok\"),\"ok\")","v":"ok"},{"$f":"IF(ISBLANK(O23), IF( OR(AN$21=\"n/a\",$AF23=FALSE,$AF23=0),\"ok\",\"not ok\"),\"ok\")","v":"ok"},{"$f":"IF(ISBLANK(P23), IF( OR(AO$21=\"n/a\",$AF23=FALSE,$AF23=0),\"ok\",\"not ok\"),\"ok\")","v":"ok"},{"$f":"IF(ISBLANK(Q23), IF( OR(AP$21=\"n/a\",$AF23=FALSE,$AF23=0),\"ok\",\"not ok\"),\"ok\")","v":"ok"}]
[null,null,null,"Masse totale de polluants au droit de la tache ",null,null,"kg",null,null,null,null,null,null,null,null,null,null,null,{"$f":"S$22","v":true},null,null,null,null,null,null,null,null,null,{"$f":"S24","v":true}]
[null,null,null,"Masse de polluants éliminée par l’assainissement suivant la variante",null,null,"kg",null,null,null,null,null,null,null,null,null,null,null,{"$f":"S$22","v":true},null,null,null,null,null,null,null,null,null,true]
[null,null,null,"Pollution résiduelle sous terrain voisin?",null,null,"choix",null,null,null,null,null,null,null,null,null,null,null,{"$f":"S$22","v":true},null,null,null,null,null,null,null,null,null,true]
[null,null,null,null,null,null,null,null,null,null,null,null,null,null,null,null,null,null,null,null,null,null,null,null,null,null,null,null,0,null,null,{"$f":"S27","v":0},{"$f":"IF(ISBLANK(H27), IF( OR(AG$21=\"n/a\",$AF27=FALSE,$AF27=0),\"ok\",\"not ok\"),\"ok\")","v":"ok"},"ok","ok","ok","ok","ok","ok","ok","ok","ok"]
[null,null,null,"Impact des actes et travaux sur la biodiversité",null,"Min","N/A",{"$f":"IF(OR(H19=\"n/a\",$S28=FALSE),\"\",IF(COUNTA(H29:H31)<3,\"champ calculé\",MATCH(H29,$T$28:$T$29,0)+MATCH(H30,$T$28:$T$29,0)+MATCH(H31,$T$28:$T$29,0)-3))","v":""},"","","","","","","","","",null,false,"non",null,null,null,null,null,null,null,null,false,null,null,{"$f":"S28","v":false},{"$f":"IF(ISBLANK(H28), IF( OR(AG$21=\"n/a\",$AF28=FALSE,$AF28=0),\"ok\",\"not ok\"),\"ok\")","v":"ok"},{"$f":"IF(ISBLANK(I28), IF( OR(AH$21=\"n/a\",$AF28=FALSE,$AF28=0),\"ok\",\"not ok\"),\"ok\")","v":"ok"},"ok","ok","ok","ok","ok","ok","ok","ok"]
[null,null,null,"Faune",null,null,"Choix",null,null,null,null,null,null,null,null,null,null,null,{"$f":"S$28","v":false},"oui",null,null,null,null,null,null,null,null,false]
[null,null,null,"Flore",null,null,"Choix",null,null,null,null,null,null,null,null,null,null,null,{"$f":"S$28","v":false},null,null,null,null,null,null,null,null,null,false]
[null,null,null,"Impact spécifique",null,null,"Choix",null,null,null,null,null,null,null,null,null,null,null,{"$f":"S$28","v":false},null,null,null,null,null,null,null,null,null,false]
[null,null,null,null,null,null,null,null,null,null,null,null,null,null,null,null,null,null,null,null,null,null,null,null,null,null,null,null,0,null,null,{"$f":"S32","v":0},{"$f":"IF(ISBLANK(H32), IF( OR(AG$21=\"n/a\",$AF32=FALSE,$AF32=0),\"ok\",\"not ok\"),\"ok\")","v":"ok"},"ok","ok","ok","ok","ok","ok","ok","ok","ok"]
[null,null,null,"Risque de mobilisation du polluant (vers eau ou air)",null,"Min","N/A",{"$f":"IF(OR(H$19=\"n/a\",$S33=FALSE),\"\",IF(COUNTA(H34:H37)<4,\"champ calculé\",INDEX($W36:$Y36,0,MATCH(H36,$T36:$V36,0))*H37+INDEX($W34:$X34,0,MATCH(H34,$T34:$U34,0))*H35))","v":""},{"$f":"IF(OR(I$19=\"n/a\",$S33=FALSE),\"\",IF(COUNTA(I34:I37)<4,\"champ calculé\",INDEX($W36:$Y36,0,MATCH(I36,$T36:$V36,0))*I37+INDEX($W34:$X34,0,MATCH(I34,$T34:$U34,0))*I35))","v":""},"","","","","","","","",null,false,null,null,null,null,null,null,null,null,null,false,null,null,{"$f":"S33","v":false},{"$f":"IF(ISBLANK(H33), IF( OR(AG$21=\"n/a\",$AF33=FALSE,$AF33=0),\"ok\",\"not ok\"),\"ok\")","v":"ok"},"ok","ok","ok","ok","ok","ok","ok","ok","ok"]
[null,null,null,"Risque de mobilisation des produits dans la phase gazeuse des sols?",null,null,"Choix",null,null,null,null,null,null,null,null,null,null,null,{"$f":"S$33","v":false},"oui","non",null,1,0,null,null,null,null,false]
[null,null,null,"Pourcentage de risque",null,null,"%",null,null,null,null,null,null,null,null,null,null,null,{"$f":"S$33","v":false},null,null,null,null,null,null,null,null,null,{"$f":"S35","v":false}]
[null,null,null,"Risque de mobilisation des produits dans la nappe souterraine?",null,null,"Choix",null,null,null,null,null,null,null,null,null,null,null,{"$f":"S$33","v":false},"nappe exploitable","nappe non exploitable","non",2,1,0,null,null,null,false]
[null,null,null,"Pourcentage de risque",null,null,"%",null,null,null,null,null,null,null,null,null,null,null,{"$f":"S$33","v":false},null,null,null,null,null,null,null,null,null,false]
[null,null,null,null,null,null,null,null,null,null,null,null,null,null,null,null,null,null,null,null,null,null,null,null,null,null,null,null,0]
[null,null,null,"Environnement (global)",null,null,null,null,null,null,null,null,null,null,null,null,null,null,null,{"$f":"D39","v":"Environnement (global)"},{"$f":"H43","v":0},0,0,0,0,0,0,0,0,{"$f":"Q43","v":0},null,{"$f":"COUNTIF(AG45:AP67,\"not ok\")","v":0},{"$f":"U39","v":0},0,0,0,0,0,0,0,0,0]
[null,null,null,"Restauration de la fonctionnalité du sol",null,"Min","N/A",{"$f":"IF(OR(H$19=\"n/a\",$S40=FALSE),\"\",IF(COUNTA(H41:H43)<3,\"champ calculé\",SUM(H41:H43)))","v":""},{"$f":"IF(OR(I$19=\"n/a\",$S40=FALSE),\"\",IF(COUNTA(I41:I43)<3,\"champ calculé\",SUM(I41:I43)))","v":""},"","","","","","","","",null,false,null,null,null,null,null,null,null,null,null,false]
[null,null,null,"Capacité agricole du sol ou stress biologique",null,null,"Choix",null,null,null,null,null,null,null,null,null,null,null,{"$f":"S$40","v":false},-1,0,1,null,null,null,null,null,null,{"$f":"S41","v":false}]
[null,null,null,"Imperméabilisation",null,null,"Choix",null,null,null,null,null,null,null,null,null,null,null,{"$f":"S$40","v":false},null,null,null,null,null,null,null,null,null,false]
[null,null,null,"Capacité de stockage de l'eau",null,null,"Choix",null,null,null,null,null,null,null,null,null,null,null,{"$f":"S$40","v":false},null,null,null,null,null,null,null,null,null,false]
[null,null,null,null,null,null,null,null,null,null,null,null,null,null,null,null,null,null,null,null,null,null,null,null,null,null,null,null,0]
[null,null,null,"Impact sur la biodiversité",null,"Min","N/A",{"$f":"IF(OR(H19=\"n/a\",$S45=FALSE),\"\",IF(COUNTA(H46:H48)<3,\"champ calculé\",COUNTIF(H46:H48,\"oui\")))","v":""},"","","","","","","","","",null,false,null,null,null,null,null,null,null,null,null,false,null,null,{"$f":"S45","v":false},{"$f":"IF(ISBLANK(H45), IF( OR(AG$21=\"n/a\",$AF45=FALSE,$AF45=0),\"ok\",\"not ok\"),\"ok\")","v":"ok"},"ok","ok","ok","ok","ok","ok","ok","ok","ok"]
[null,null,null,"Faune",null,null,"Choix",null,null,null,null,null,null,null,null,null,null,null,{"$f":"S$45","v":false},null,null,null,null,null,null,null,null,null,false]
[null,null,null,"Flore",null,null,"Choix",null,null,null,null,null,null,null,null,null,null,null,{"$f":"S$45","v":false},null,null,null,null,null,null,null,null,null,false]
[null,null,null,"Air",null,null,"Choix",null,null,null,null,null,null,null,null,null,null,null,{"$f":"S$45","v":false},null,null,null,null,null,null,null,null,null,false]
[null,null,null,null,null,null,null,null,null,null,null,null,null,null,null,null,null,null,null,null,null,null,null,null,null,null,null,null,0,null,null,{"$f":"S49","v":0},{"$f":"IF(ISBLANK(H49), IF( OR(AG$21=\"n/a\",$AF49=FALSE,$AF49=0),\"ok\",\"not ok\"),\"ok\")","v":"ok"},"ok","ok","ok","ok","ok","ok","ok","ok","ok"]
[null,null,null,"Bilan écologique",null,"Min","N/A",{"$f":"IF(OR(H$19=\"n/a\",$S50=FALSE),\"\",IF(AND(ISNUMBER(H52*H51+H54*H51+H56*H51+H58*$T$58+H60*$T$58+H62*$T$58+H64*$T$58),COUNTA(H51)=1),H52*H51+H54*H51+H56*H51+H58*$T$58+H60*$T$58+H62*$T$58+H64*$T$58,\"champ calculé\"))","v":""},{"$f":"IF(OR(I$19=\"n/a\",$S50=FALSE),\"\",IF(AND(ISNUMBER(I52*I51+I54*I51+I56*I51+I58*$T$58+I60*$T$58+I62*$T$58+I64*$T$58),COUNTA(I51)=1),I52*I51+I54*I51+I56*I51+I58*$T$58+I60*$T$58+I62*$T$58+I64*$T$58,\"champ calculé\"))","v":""},{"$f":"IF(OR(J$19=\"n/a\",$S50=FALSE),\"\",IF(AND(ISNUMBER(J52*J51+J54*J51+J56*J51+J58*$T$58+J60*$T$58+J62*$T$58+J64*$T$58),COUNTA(J51)=1),J52*J51+J54*J51+J56*J51+J58*$T$58+J60*$T$58+J62*$T$58+J64*$T$58,\"champ calculé\"))","v":""},{"$f":"IF(OR(K$19=\"n/a\",$S50=FALSE),\"\",IF(AND(ISNUMBER(K52*K51+K54*K51+K56*K51+K58*$T$58+K60*$T$58+K62*$T$58+K64*$T$58),COUNTA(K51)=1),K52*K51+K54*K51+K56*K51+K58*$T$58+K60*$T$58+K62*$T$58+K64*$T$58,\"champ calculé\"))","v":""},{"$f":"IF(OR(L$19=\"n/a\",$S50=FALSE),\"\",IF(AND(ISNUMBER(L52*L51+L54*L51+L56*L51+L58*$T$58+L60*$T$58+L62*$T$58+L64*$T$58),COUNTA(L51)=1),L52*L51+L54*L51+L56*L51+L58*$T$58+L60*$T$58+L62*$T$58+L64*$T$58,\"champ calculé\"))","v":""},{"$f":"IF(OR(M$19=\"n/a\",$S50=FALSE),\"\",IF(AND(ISNUMBER(M52*M51+M54*M51+M56*M51+M58*$T$58+M60*$T$58+M62*$T$58+M64*$T$58),COUNTA(M51)=1),M52*M51+M54*M51+M56*M51+M58*$T$58+M60*$T$58+M62*$T$58+M64*$T$58,\"champ calculé\"))","v":""},108,{"$f":"IF(OR(O$19=\"n/a\",$S50=FALSE),\"\",IF(AND(ISNUMBER(O52*O51+O54*O51+O56*O51+O58*$T$58+O60*$T$58+O62*$T$58+O64*$T$58),COUNTA(O51)=1),O52*O51+O54*O51+O56*O51+O58*$T$58+O60*$T$58+O62*$T$58+O64*$T$58,\"champ calculé\"))","v":""},{"$f":"IF(OR(P$19=\"n/a\",$S50=FALSE),\"\",IF(AND(ISNUMBER(P52*P51+P54*P51+P56*P51+P58*$T$58+P60*$T$58+P62*$T$58+P64*$T$58),COUNTA(P51)=1),P52*P51+P54*P51+P56*P51+P58*$T$58+P60*$T$58+P62*$T$58+P64*$T$58,\"champ calculé\"))","v":""},{"$f":"IF(OR(Q$19=\"n/a\",$S50=FALSE),\"\",IF(AND(ISNUMBER(Q52*Q51+Q54*Q51+Q56*Q51+Q58*$T$58+Q60*$T$58+Q62*$T$58+Q64*$T$58),COUNTA(Q51)=1),Q52*Q51+Q54*Q51+Q56*Q51+Q58*$T$58+Q60*$T$58+Q62*$T$58+Q64*$T$58,\"champ calculé\"))","v":""},null,true,null,null,null,null,null,null,null,null,null,false,null,null,{"$f":"S50","v":true},"ok","ok","ok","ok","ok","ok","ok","ok","ok","ok"]
[null,null,null,"Durée de l'assainissement actif",null,null,"mois",null,null,null,null,null,null,null,null,null,null,null,{"$f":"S$50","v":true},null,null,null,null,null,null,null,null,null,true]
[null,null,null,"Qualité de l'air",null,null,"N/A",{"$f":"IF(OR(H$19=\"n/a\",$S52=FALSE),\"\",IF(COUNTA(H53:H53)<1,\"champ calculé\",H53))","v":""},{"$f":"IF(OR(I$19=\"n/a\",$S52=FALSE),\"\",IF(COUNTA(I53:I53)<1,\"champ calculé\",I53))","v":""},"","","","","","","","",null,{"$f":"S$50","v":true},null,null,null,null,null,null,null,null,null,false]
[null,null,null,"Score qualité de l'air",null,null,"choix",null,null,null,null,null,null,null,null,null,null,null,true,0,1,2,3,4,null,null,null,null,true]
[null,null,null,"Qualité de l’eau ",null,null,"N/A",{"$f":"IF(OR(H$19=\"n/a\",$S54=FALSE),\"\",IF(COUNTA(H55)<1,\"champ calculé\",IF(H55=$T55,0,IF(H55=$U55,2,IF(H55=$V55,3,\"\")))))","v":""},{"$f":"IF(OR(I$19=\"n/a\",$S54=FALSE),\"\",IF(COUNTA(I55)<1,\"champ calculé\",IF(I55=$T55,0,IF(I55=$U55,2,IF(I55=$V55,3,\"\")))))","v":""},"","","","","","","","",null,true,"pas de rejet","débit < x m³/h.","débit > x m³/h.",null,null,null,null,null,null,false]
[null,null,null,"Débit de rejet d'eau",null,null,"Choix",null,null,null,null,null,null,null,null,null,null,null,true,"pas de rejet","rejet en STEP","rejet en eau de surface",null,null,null,null,null,null,true]
[null,null,null,"Consommation d’eau",null,null,"N/A",{"$f":"IF(OR(H$19=\"n/a\",$S56=FALSE),\"\",IF(COUNTA(H57)<1,\"champ calculé\",IF(H57=$T56,0,IF(H57=$U56,2,IF(H57=$V56,3,\"\")))))","v":""},{"$f":"IF(OR(I$19=\"n/a\",$S56=FALSE),\"\",IF(COUNTA(I57)<1,\"champ calculé\",IF(I57=$T56,0,IF(I57=$U56,2,IF(I57=$V56,3,\"\")))))","v":""},"","","","","","","","",null,true,0,"équiv. 4m3 par jour",">  4m3 par jour",null,null,null,null,null,null,false]
[null,null,null,"Consommation d'eau du projet",null,null,"Choix",null,null,null,null,null,null,null,null,null,null,null,true,null,null,null,null,null,null,null,null,null,true]
[null,null,null,"Terres saines d'apport",null,null,"N/A",{"$f":"IF(OR(H$19=\"n/a\",$S58=FALSE),\"\",IF(COUNTA(H59)<1,\"champ calculé\",INDEX($W59:$Y59,MATCH(H59,$T59:$V59,0))))","v":""},{"$f":"IF(OR(I$19=\"n/a\",$S58=FALSE),\"\",IF(COUNTA(I59)<1,\"champ calculé\",INDEX($W59:$Y59,MATCH(I59,$T59:$V59,0))))","v":""},"","","","","","","","",null,true,{"$f":"MIN(IF(H19:Q19<>\"n/a\",H51:Q51,\"\"))","v":0},null,null,null,null,null,null,null,null,false]
[null,null,null,"Volume de terres saines apportées sur le site",null,null,"Nb",null,null,null,null,null,null,null,null,null,null,null,true,"0m3"," 0 à 600m3",">600m3",0,2,3,null,null,null,true]
[null,null,null,"Altération du matériaux originel",null,null,"N/A",{"$f":"IF(OR(H$19=\"n/a\",$S58=FALSE),\"\",IF(COUNTA(H61)<1,\"champ calculé\",H61))","v":""},{"$f":"IF(OR(I$19=\"n/a\",$S58=FALSE),\"\",IF(COUNTA(I61)<1,\"champ calculé\",I61))","v":""},"","","","","","","","",null,true,0,2,3,null,null,null,null,null,null,false]
[null,null,null,"Altération du matériaux originel",null,null,"choix",null,null,null,null,null,null,null,null,null,null,null,true,null,null,null,null,null,null,null,null,null,true]
[null,null,null,"Matériaux",null,null,"N/A",{"$f":"IF(OR(H$19=\"n/a\",$S62=FALSE),\"\",IF(COUNTA(H63)<1,\"champ calculé\",INDEX($X63:$AA63,MATCH(H63,$T63:$W63,0))))","v":""},{"$f":"IF(OR(I$19=\"n/a\",$S62=FALSE),\"\",IF(COUNTA(I63)<1,\"champ calculé\",INDEX($X63:$AA63,MATCH(I63,$T63:$W63,0))))","v":""},"","","","","","","","",null,true,null,null,null,null,null,null,null,null,null,false]
[null,null,null,"Recyclage des matériaux",null,null,"Choix",null,null,null,null,null,null,null,null,null,null,null,true,"aucun","recyclés","non recyclés","les deux",0,0,3,2,null,true]
[null,null,null,"Déchets",null,null,"N/A",{"$f":"IF(OR(H$19=\"n/a\",$S64=FALSE),\"\",IF(COUNTA(H65)<1,\"champ calculé\",H65))","v":""},{"$f":"IF(OR(I$19=\"n/a\",$S64=FALSE),\"\",IF(COUNTA(I65)<1,\"champ calculé\",I65))","v":""},"","","","","","","","",null,true,null,null,null,null,null,null,null,null,null,false]
[null,null,null,"Déchets",null,null,"N/A",null,null,null,null,null,null,null,null,null,null,null,true,0,1,2,3,4,null,3,2,null,{"$f":"S65","v":true}]
[null,null,null,null,null,null,null,null,null,null,null,null,null,null,null,null,null,null,null,null,null,null,null,null,null,null,null,null,0,null,null,{"$f":"S66","v":0},{"$f":"IF(ISBLANK(H66), IF( OR(AG$21=\"n/a\",$AF66=FALSE,$AF66=0),\"ok\",\"not ok\"),\"ok\")","v":"ok"},{"$f":"IF(ISBLANK(I66), IF( OR(AH$21=\"n/a\",$AF66=FALSE,$AF66=0),\"ok\",\"not ok\"),\"ok\")","v":"ok"},{"$f":"IF(ISBLANK(J66), IF( OR(AI$21=\"n/a\",$AF66=FALSE,$AF66=0),\"ok\",\"not ok\"),\"ok\")","v":"ok"},{"$f":"IF(ISBLANK(K66), IF( OR(AJ$21=\"n/a\",$AF66=FALSE,$AF66=0),\"ok\",\"not ok\"),\"ok\")","v":"ok"},{"$f":"IF(ISBLANK(L66), IF( OR(AK$21=\"n/a\",$AF66=FALSE,$AF66=0),\"ok\",\"not ok\"),\"ok\")","v":"ok"},{"$f":"IF(ISBLANK(M66), IF( OR(AL$21=\"n/a\",$AF66=FALSE,$AF66=0),\"ok\",\"not ok\"),\"ok\")","v":"ok"},{"$f":"IF(ISBLANK(N66), IF( OR(AM$21=\"n/a\",$AF66=FALSE,$AF66=0),\"ok\",\"not ok\"),\"ok\")","v":"ok"},{"$f":"IF(ISBLANK(O66), IF( OR(AN$21=\"n/a\",$AF66=FALSE,$AF66=0),\"ok\",\"not ok\"),\"ok\")","v":"ok"},{"$f":"IF(ISBLANK(P66), IF( OR(AO$21=\"n/a\",$AF66=FALSE,$AF66=0),\"ok\",\"not ok\"),\"ok\")","v":"ok"},{"$f":"IF(ISBLANK(Q66), IF( OR(AP$21=\"n/a\",$AF66=FALSE,$AF66=0),\"ok\",\"not ok\"),\"ok\")","v":"ok"}]
[null,null,null,"Energie",null,"Min","N/A",{"$f":"IF(OR(H$19=\"n/a\",$S67=FALSE),\"\",IF(COUNTA(H68:H70)<3,\"champ calculé\",H68*H69*HLOOKUP(H70,$T70:$V71,2,0)))","v":""},{"$f":"IF(OR(I$19=\"n/a\",$S67=FALSE),\"\",IF(COUNTA(I68:I70)<3,\"champ calculé\",I68*I69*HLOOKUP(I70,$T70:$V71,2,0)))","v":""},"","","","","","","","",null,true,null,null,null,null,null,null,null,null,null,false,null,null,{"$f":"S67","v":true},"ok","ok","ok","ok","ok","ok","ok","ok","ok","ok"]
[null,null,null,"Nombre de tonnes à assainir",null,null,"tonnes",null,null,null,null,null,null,null,null,null,null,null,{"$f":"S$67","v":true},null,null,null,null,null,null,null,null,null,true]
[null,null,null,"Facteur de conversion",null,null,"N/A",null,null,null,null,null,null,null,null,null,null,null,{"$f":"S$67","v":true},1,2,4,5,12,null,null,null,null,true]
[null,null,null,"Pourcentage des besoins du projet couverts par les énergies renouvelables",null,null,"%",null,null,null,null,null,null,null,null,null,null,null,true,"0% - 20%","20% - 40%",">40%",null,null,null,null,null,null,true]
[null,null,null,null,null,null,null,null,null,null,null,null,null,null,null,null,null,null,null,1,0.8,0.6]

{"sheet":"Eval_soc","index":10,"n_rows":45,"n_cols":43,"rows_kept":45,"cut":false,"hidden":false,"merged":[[11,12,15,12]]}
[]
[]
[]
[]
[]
[]
[]
[]
[]
[]
[]
[null,null,null,null,null,null,null,null,null,null,null,null,null,null,null,"Vérifie le poids des critères"]
[null,null,null,null,null,null,null,null,null,null,null,null,null,null,null,"Vérifie les cellules désactivés"]
[null,null,null,null,null,null,null,null,null,null,null,null,null,null,null,"Vérifie les cellules activés",{"$f":"IF(ISNUMBER(SEARCH(\"pasvalscénarioact\",CONCATENATE(G18,H18,I18,J18,K18,L18,M18,#REF!,#REF!,#REF!))),1,0)","v":0},{"$f":"IF(Q14=1, \"Attention! Vous n'avez pas attribué toutes les valeurs à tous les scénarios activés!\",\"\")","v":""}]
[null,null,null,null,null,null,null,null,null,null,null,null,null,null,null,null,"Max"]
[null,null,null,null,null,null,null,null,null,null,null,null,null,null,null,null,"Min"]
[]
[null,null,null,null,null,null,{"$f":"IF(AND(COUNTA(H22:H39,#REF!,#REF!,#REF!,#REF!,#REF!)<35,H20=1),\"pasvalscénarioact\",\"ok\")","v":"pasvalscénarioact"},{"$f":"IF(AND(COUNTA(I22:I39,#REF!,#REF!,#REF!,#REF!,#REF!)<35,I20=1),\"pasvalscénarioact\",\"ok\")","v":"ok"},{"$f":"IF(AND(COUNTA(J22:J39,#REF!,#REF!,#REF!,#REF!,#REF!)<35,J20=1),\"pasvalscénarioact\",\"ok\")","v":"ok"},{"$f":"IF(AND(COUNTA(K22:K39,#REF!,#REF!,#REF!,#REF!,#REF!)<35,K20=1),\"pasvalscénarioact\",\"ok\")","v":"ok"},{"$f":"IF(AND(COUNTA(L22:L39,#REF!,#REF!,#REF!,#REF!,#REF!)<35,L20=1),\"pasvalscénarioact\",\"ok\")","v":"ok"},{"$f":"IF(AND(COUNTA(M22:M39,#REF!,#REF!,#REF!,#REF!,#REF!)<35,M20=1),\"pasvalscénarioact\",\"ok\")","v":"ok"},{"$f":"IF(AND(COUNTA(#REF!,#REF!,#REF!,#REF!,#REF!,#REF!)<35,#REF!=1),\"pasvalscénarioact\",\"ok\")","v":{"$error":"#REF!"}},null,null,null,null,null,null,{"$f":"COUNTIF(H22:Q45,\"champ calculé\")","v":0},{"$f":"Accueil!X7","v":0},null,null,null,null,null,null,null,null,null,null,"verification",{"$f":"SUM(AF21,#REF!,#REF!,#REF!,#REF!)","v":{"$error":"#REF!"}}]
[null,null,null,"Catégorie/Indicateur",null,"Max /Min","Unité",{"$f":"Scenarios!W1","v":"n/a"},{"$f":"Scenarios!X1","v":"n/a"},{"$f":"Scenarios!Y1","v":"n/a"},{"$f":"Scenarios!Z1","v":"n/a"},{"$f":"Scenarios!AA1","v":"n/a"},{"$f":"Scenarios!AB1","v":"n/a"},{"$f":"Scenarios!AC1","v":"n/a"},{"$f":"Scenarios!AD1","v":"n/a"},{"$f":"Scenarios!AE1","v":"n/a"},{"$f":"Scenarios!AF1","v":"n/a"},null,null,"rows","columns"]
[null,null,null,null,null,null,null,{"$f":"Scenarios!X22","v":1},{"$f":"Scenarios!X24","v":2},{"$f":"Scenarios!X26","v":3},{"$f":"Scenarios!X28","v":4},{"$f":"Scenarios!X30","v":5},{"$f":"Scenarios!X32","v":6},{"$f":"Scenarios!X40","v":10},null,null,null,null,null,{"$f":"COUNTIF(T22:T37,\"<>n/a\")","v":16},{"$f":"COUNTIF(U21:AD21,\"<>n/a\"\n)","v":0}]
[null,null,null,"Social (local)",null,null,null,null,null,null,null,null,null,null,null,null,null,null,null,{"$f":"D21","v":"Social (local)"},{"$f":"H19","v":"n/a"},"n/a","n/a","n/a","n/a","n/a","n/a","n/a","n/a","n/a",null,{"$f":"COUNTIF(AG22:AP41,\"not ok\")","v":0},{"$f":"U21","v":"n/a"},{"$f":"V21","v":"n/a"},"n/a","n/a","n/a","n/a","n/a","n/a","n/a","n/a"]
[null,null,null,"Nuisance environnementale sur chantier",null,"Min","N/A",{"$f":"IF(OR(H19=\"n/a\",$S22=FALSE),\"\",IF(COUNTA(H23:H29)<7,\"champ calculé\",(COUNTIF(H23:H28,\"moyen\")*2+COUNTIF(H23:H28,\"fort\")*3)*H29))","v":""},{"$f":"IF(OR(I19=\"n/a\",$S22=FALSE),\"\",IF(COUNTA(I23:I29)<7,\"champ calculé\",(COUNTIF(I23:I28,\"moyen\")*2+COUNTIF(I23:I28,\"fort\")*3)*I29))","v":""},"","","","","","","","",null,true,null,null,null,null,false,null,null,null,null,null,null,null,{"$f":"S22","v":true},{"$f":"IF(ISBLANK(H22), IF( OR(AG$21=\"n/a\",$AF22=FALSE,$AF22=0),\"ok\",\"not ok\"),\"ok\")","v":"ok"},"ok","ok","ok","ok","ok","ok","ok","ok","ok"]
[null,null,null,"Nuisance olfactive",null,null,"échelle",null,null,null,null,null,null,null,null,null,null,null,{"$f":"S$22","v":true},"faible","moyen","fort",null,{"$f":"S23","v":true}]
[null,null,null,"Vibration",null,null,"échelle",null,null,null,null,null,null,null,null,null,null,null,true,0,2,3,null,true]
[null,null,null,"Poussière",null,null,"échelle",null,null,null,null,null,null,null,null,null,null,null,true,null,null,null,null,true]
[null,null,null,"Nuisance sonore",null,null,"échelle",null,null,null,null,null,null,null,null,null,null,null,true,null,null,null,null,true]
[null,null,null,"Lumière",null,null,"échelle",null,null,null,null,null,null,null,null,null,null,null,true,null,null,null,null,true]
[null,null,null,"Visuel",null,null,"échelle",null,null,null,null,null,null,null,null,null,null,null,true,null,null,null,null,true]
[null,null,null,"Durée de l’assainissement dit actif (pas la durée de la surveillance)",null,null,"mois",null,null,null,null,null,null,null,null,null,null,null,true,null,null,null,null,true]
[null,null,null,null,null,null,null,null,null,null,null,null,null,null,null,null,null,null,null,null,null,null,null,0,null,null,null,null,null,null,null,{"$f":"S30","v":0},{"$f":"IF(ISBLANK(H30), IF( OR(AG$21=\"n/a\",$AF30=FALSE,$AF30=0),\"ok\",\"not ok\"),\"ok\")","v":"ok"},"ok","ok","ok","ok","ok","ok","ok","ok","ok"]
[null,null,null,"Nuisance environnementale liée au charroi",null,"Min","N/A",{"$f":"IF(OR(H19=\"n/a\",$S31=FALSE),\"\",IF(COUNTA(H32:H36)<5,\"champ calculé\",HLOOKUP(H34,$T34:$V37,4,0)*H32*H33*(H35+1)*H36))","v":""},{"$f":"IF(OR(I19=\"n/a\",$S31=FALSE),\"\",IF(COUNTA(I32:I36)<5,\"champ calculé\",HLOOKUP(I34,$T34:$V37,4,0)*I32*I33*(I35+1)*I36))","v":""},"","","","","","","","",null,true,{"$f":"HLOOKUP(L34,$T34:$V37,3,0)","v":{"$error":"#N/A"}},null,null,null,false,null,null,null,null,null,null,null,{"$f":"S31","v":true},"ok","ok","ok","ok","ok","ok","ok","ok","ok","ok"]
[null,null,null,"Nombre de camions par jour",null,null,"nombre",null,null,null,null,null,null,null,null,null,null,null,{"$f":"S$31","v":true},null,null,null,null,true]
[null,null,null,"Durée de l’assainissement",null,null,"semaines",null,null,null,null,null,null,null,null,null,null,null,{"$f":"S$31","v":true},null,null,null,null,true]
[null,null,null,"Restriction de circulation",null,null,"choix",null,null,null,null,null,null,null,null,null,null,null,{"$f":"S$31","v":true},"aucune","faible","forte",null,{"$f":"S34","v":true},null,null,null,null,null,null,null,null,null,null,null,null,null,null,null,null,null,null,"Restriction de circulation :\n• faible: si aucune restriction ne sont appliquée\n• moyen: si une route d’accès est bloquée mais que le voisinage reste accessible\n• fort: si la zone n’est plus accessible"]
[null,null,null,"Durée de blocage",null,null,"semaines",null,null,null,null,null,null,null,null,null,null,null,{"$f":"S$31","v":true},null,null,null,null,true]
[null,null,null,"Distance par rapport à la première route nationale",null,null,"km",null,null,null,null,null,null,null,null,null,null,null,{"$f":"S$31","v":true},null,null,null,null,true]
[null,null,null,null,null,null,null,null,null,null,null,null,null,null,null,null,null,null,null,1,1.25,2,null,0,null,null,null,null,null,null,null,{"$f":"S37","v":0},{"$f":"IF(ISBLANK(H37), IF( OR(AG$21=\"n/a\",$AF37=FALSE,$AF37=0),\"ok\",\"not ok\"),\"ok\")","v":"ok"},"ok","ok","ok","ok","ok","ok","ok","ok","ok"]
[null,null,null,"Social (global)",null,null,null,null,null,null,null,null,null,null,null,null,null,null,null,{"$f":"D38","v":"Social (global)"},{"$f":"H45","v":0},{"$f":"I45","v":0},{"$f":"J45","v":0},0,{"$f":"L45","v":0},0,0,0,0,0,null,{"$f":"COUNTIF(#REF!,\"not ok\")","v":{"$error":"#REF!"}},{"$f":"U38","v":0},0,0,0,0,0,0,0,0,0]
[null,null,null,"Impact paysager",null,"Min","m",{"$f":"IF(OR(H19=\"n/a\",$S39=FALSE),\"\",IF(COUNTA(H40:H40)<1,\"champ calculé\",H40))","v":""},{"$f":"IF(OR(I19=\"n/a\",$S39=FALSE),\"\",IF(COUNTA(I40:I40)<1,\"champ calculé\",I40))","v":""},"","","","","","","","",null,false,null,null,null,null,false,null,null,null,null,null,null,null,{"$f":"S39","v":false},"ok","ok","ok","ok","ok","ok","ok","ok","ok","ok"]
[null,null,null,"Impact paysager",null,null,"m",null,null,null,null,null,null,null,null,null,null,null,{"$f":"S$39","v":false},0,1,3,null,false]
[null,null,null,null,null,null,null,null,null,null,null,null,null,null,null,null,null,null,null,null,null,null,null,0,null,null,null,null,null,null,null,{"$f":"S41","v":0},{"$f":"IF(ISBLANK(H41), IF( OR(AG$21=\"n/a\",$AF41=FALSE,$AF41=0),\"ok\",\"not ok\"),\"ok\")","v":"ok"},"ok","ok","ok","ok","ok","ok","ok","ok","ok"]
[null,null,null,"Impact patrimonial",null,null,null,{"$f":"IF(OR(H19=\"n/a\",$S42=FALSE),\"\",IF(COUNTA(H43:H45)<3,\"champ calculé\",IF(COUNTIF(H43:H45,\"oui\")=0,0,IF(COUNTIF(H43:H45,\"oui\")=1,2,3))))","v":""},"","","","","","","","","",null,false,null,null,null,null,false]
[null,null,null,"Existe-t-il un impact sur l'alignement des arbres?",null,null,"choix",null,null,null,null,null,null,null,null,null,null,null,false,"non","oui",null,null,false]
[null,null,null,"Existe-t-il un impact sur le patrimoine architectural tel que des bâtiments classés ou autres?",null,null,"choix",null,null,null,null,null,null,null,null,null,null,null,false,"non","oui",null,null,false]
[null,null,null,"Existe-t-il un impact sur le patrimoine naturel remarquable, tel que la supression d'arbres remarquables?",null,null,"choix",null,null,null,null,null,null,null,null,null,null,null,false,"non","oui",null,null,false]

{"sheet":"Synthese","index":11,"n_rows":95,"n_cols":42,"rows_kept":95,"cut":false,"hidden":false,"merged":[]}
[null,2,3,4,5,8,9,10,11,12,13,14,15,16,17,18,19,20,null,22,"Coût","Cout de fonctionnement","Cout des mesures complémentaires et compensatoires (mesure de réparation)","Environnement (local)","Cout d’investissement","Cout de mesures de sécurité et de suivi","Persistance de pollutions résiduelles et usage du terrain","n/a","n/a","n/a",33]
[]
[]
[]
[]
[]
[]
[]
[]
[]
[null,null,null,null,null,null,null,null,null,null,null,"Pondérations globales:"]
[null,null,null,null,null,null,null,null,null,null,null,"Environnement:",null,{"$f":"VLOOKUP(CONCATENATE(Accueil!$F$20,\",\",'Descriptif site'!$J$27,\",\",'Descriptif site'!$J$29),Pond_glob!$D$1:$G$37,2,0)","v":"Complétez les pages \"Accueil\" et \"Descriptif site\""}]
[null,null,null,null,null,null,null,null,null,null,null,"Social:",null,{"$f":"VLOOKUP(CONCATENATE(Accueil!$F$20,\",\",'Descriptif site'!$J$27,\",\",'Descriptif site'!$J$29),Pond_glob!$D$1:$G$37,3,0)","v":"Complétez les pages \"Accueil\" et \"Descriptif site\""}]
[null,null,null,null,null,null,null,null,null,null,null,"Coût:",null,{"$f":"VLOOKUP(CONCATENATE(Accueil!$F$20,\",\",'Descriptif site'!$J$27,\",\",'Descriptif site'!$J$29),Pond_glob!$D$1:$G$37,4,0)","v":"Complétez les pages \"Accueil\" et \"Descriptif site\""}]
[null,null,null,null,null,null,null,null,null,null,null,null,null,null,null,null,"Max"]
[null,null,null,null,null,null,null,null,null,null,null,null,null,null,null,null,"Min"]
[]
[null,null,null,null,null,null,{"$f":"IF(AND(COUNTA(H22:H26,H40:H56,H58:H60,#REF!,#REF!,#REF!)<35,H20=1),\"pasvalscénarioact\",\"ok\")","v":"pasvalscénarioact"},{"$f":"IF(AND(COUNTA(I22:I26,I40:I56,I58:I60,#REF!,#REF!,#REF!)<35,I20=1),\"pasvalscénarioact\",\"ok\")","v":"ok"},{"$f":"IF(AND(COUNTA(J22:J26,J40:J56,J58:J60,#REF!,#REF!,#REF!)<35,J20=1),\"pasvalscénarioact\",\"ok\")","v":"ok"},{"$f":"IF(AND(COUNTA(K22:K26,K40:K56,K58:K60,#REF!,#REF!,#REF!)<35,K20=1),\"pasvalscénarioact\",\"ok\")","v":"ok"},{"$f":"IF(AND(COUNTA(L22:L26,L40:L56,L58:L60,#REF!,#REF!,#REF!)<35,L20=1),\"pasvalscénarioact\",\"ok\")","v":"ok"},{"$f":"IF(AND(COUNTA(M22:M26,M40:M56,M58:M60,#REF!,#REF!,#REF!)<35,M20=1),\"pasvalscénarioact\",\"ok\")","v":"ok"},{"$f":"IF(AND(COUNTA(#REF!,#REF!,#REF!,#REF!,#REF!,#REF!)<35,#REF!=1),\"pasvalscénarioact\",\"ok\")","v":{"$error":"#REF!"}},null,null,null,null,null,null,null,{"$f":"Accueil!W7","v":4},null,false,null,null,null,null,null,null,null,null,"verification",{"$f":"SUM(AF21,AF39,AF55,AF73,AF87)","v":0}]
[null,null,null,"Catégorie/Indicateur",null,"Max /Min","Unité",{"$f":"Scenarios!W1","v":"n/a"},{"$f":"Scenarios!X1","v":"n/a"},{"$f":"Scenarios!Y1","v":"n/a"},{"$f":"Scenarios!Z1","v":"n/a"},{"$f":"Scenarios!AA1","v":"n/a"},{"$f":"Scenarios!AB1","v":"n/a"},{"$f":"Scenarios!AC1","v":"n/a"},{"$f":"Scenarios!AD1","v":"n/a"},{"$f":"Scenarios!AE1","v":"n/a"},{"$f":"Scenarios!AF1","v":"n/a"},null,null,"rows","columns"]
[null,null,null,null,null,null,null,{"$f":"Scenarios!X22","v":1},{"$f":"Scenarios!X24","v":2},{"$f":"Scenarios!X26","v":3},{"$f":"Scenarios!X28","v":4},{"$f":"Scenarios!X30","v":5},{"$f":"Scenarios!X32","v":6},{"$f":"Scenarios!X40","v":10},null,null,null,null,null,{"$f":"COUNTIF(T22:T25,\"<>n/a\")","v":1},{"$f":"COUNTIF(U21:AD21,\"<>n/a\"\n)","v":0}]
[null,null,null,"Coût",null,null,null,null,null,null,null,null,null,null,null,null,null,null,null,{"$f":"D21","v":"Coût"},{"$f":"H19","v":"n/a"},"n/a","n/a","n/a","n/a","n/a","n/a","n/a","n/a","n/a",null,{"$f":"COUNTIF(AG22:AP28,\"not ok\")","v":0},{"$f":"U21","v":"n/a"},{"$f":"V21","v":"n/a"},"n/a","n/a","n/a","n/a","n/a","n/a","n/a","n/a"]
[null,null,null,"Coût d’investissement et de fonctionnement",null,"Min","Unité",{"$f":"Eval_cout!H22","v":0},{"$f":"Eval_cout!I22","v":0},{"$f":"Eval_cout!J22","v":0},{"$f":"Eval_cout!K22","v":0},{"$f":"Eval_cout!L22","v":0},{"$f":"Eval_cout!M22","v":0},{"$f":"Eval_cout!N22","v":0},{"$f":"Eval_cout!O22","v":0},{"$f":"Eval_cout!P22","v":0},{"$f":"Eval_cout!Q22","v":0},null,{"$f":"Eval_cout!S22","v":true},"Coût d’investissement et de fonctionnement",{"$f":"VLOOKUP($T22,$D$22:$Q$28,4+MATCH(U$21,$U$21:$AD$21,0),0)","v":0},{"$f":"VLOOKUP($T22,$D$22:$Q$28,4+MATCH(V$21,$U$21:$AD$21,0),0)","v":0},{"$f":"VLOOKUP($T22,$D$22:$Q$28,4+MATCH(W$21,$U$21:$AD$21,0),0)","v":0},0,0,0,0,0,0,0,null,{"$f":"S22","v":true},{"$f":"IF(ISBLANK(H22), IF( OR(AG$21=\"n/a\",$AF22=FALSE,$AF22=0),\"ok\",\"not ok\"),\"ok\")","v":"ok"},{"$f":"IF(ISBLANK(I22), IF( OR(AH$21=\"n/a\",$AF22=FALSE,$AF22=0),\"ok\",\"not ok\"),\"ok\")","v":"ok"},"ok","ok","ok","ok","ok","ok","ok","ok"]
[null,null,null,null,null,null,null,null,null,null,null,null,null,null,null,null,null,null,null,"n/a",{"$f":"VLOOKUP($T23,$D$22:$Q$28,4+MATCH(U$21,$U$21:$AD$21,0),0)","v":{"$error":"#N/A"}},{"$error":"#N/A"},{"$error":"#N/A"},{"$error":"#N/A"},{"$error":"#N/A"},{"$error":"#N/A"},{"$error":"#N/A"},{"$error":"#N/A"},{"$error":"#N/A"},{"$error":"#N/A"},null,0,{"$f":"IF(ISBLANK(H23), IF( OR(AG$21=\"n/a\",$AF23=FALSE,$AF23=0),\"ok\",\"not ok\"),\"ok\")","v":"ok"},"ok","ok","ok","ok","ok","ok","ok","ok","ok"]
[null,null,null,"Coût de mesures de sécurité et de suivi",null,"Min","Unité",{"$f":"Eval_cout!H28","v":""},{"$f":"Eval_cout!I28","v":""},{"$f":"Eval_cout!J28","v":""},{"$f":"Eval_cout!K28","v":""},{"$f":"Eval_cout!L28","v":""},{"$f":"Eval_cout!M28","v":""},{"$f":"Eval_cout!N28","v":""},{"$f":"Eval_cout!O28","v":""},{"$f":"Eval_cout!P28","v":""},{"$f":"Eval_cout!Q28","v":""},null,{"$f":"Eval_cout!S28","v":false},"n/a",{"$error":"#N/A"},{"$error":"#N/A"},{"$error":"#N/A"},{"$error":"#N/A"},{"$error":"#N/A"},{"$error":"#N/A"},{"$error":"#N/A"},{"$error":"#N/A"},{"$error":"#N/A"},{"$error":"#N/A"},null,false,{"$f":"IF(ISBLANK(H24), IF( OR(AG$21=\"n/a\",$AF24=FALSE,$AF24=0),\"ok\",\"not ok\"),\"ok\")","v":"ok"},"ok","ok","ok","ok","ok","ok","ok","ok","ok"]
[null,null,null,null,null,null,null,null,null,null,null,null,null,null,null,null,null,null,null,"n/a",{"$error":"#N/A"},{"$error":"#N/A"},{"$error":"#N/A"},{"$error":"#N/A"},{"$error":"#N/A"},{"$error":"#N/A"},{"$error":"#N/A"},{"$error":"#N/A"},{"$error":"#N/A"},{"$error":"#N/A"},null,0,{"$f":"IF(ISBLANK(H25), IF( OR(AG$21=\"n/a\",$AF25=FALSE,$AF25=0),\"ok\",\"not ok\"),\"ok\")","v":"ok"},"ok","ok","ok","ok","ok","ok","ok","ok","ok"]
[null,null,null,"Coût des mesures complémentaires et compensatoires",null,"Min","Unité",{"$f":"Eval_cout!H32","v":""},{"$f":"Eval_cout!I32","v":""},{"$f":"Eval_cout!J32","v":""},{"$f":"Eval_cout!K32","v":""},{"$f":"Eval_cout!L32","v":""},{"$f":"Eval_cout!M32","v":""},{"$f":"Eval_cout!N32","v":""},{"$f":"Eval_cout!O32","v":""},{"$f":"Eval_cout!P32","v":""},{"$f":"Eval_cout!Q32","v":""},null,{"$f":"Eval_cout!S32","v":false},null,null,null,null,null,null,null,null,null,null,null,null,false,"ok","ok","ok","ok","ok","ok","ok","ok","ok","ok"]
[null,null,null,null,null,null,null,null,null,null,null,null,null,null,null,null,null,null,null,null,null,null,null,null,null,null,null,null,null,null,null,0,"ok","ok","ok","ok","ok","ok","ok","ok","ok","ok"]
[null,null,null,"Coûts lié à la persistance de pollutions résiduelles et usage du terrain",null,"Min","Unité",{"$f":"Eval_cout!H36","v":""},{"$f":"Eval_cout!I36","v":""},{"$f":"Eval_cout!J36","v":""},{"$f":"Eval_cout!K36","v":""},{"$f":"Eval_cout!L36","v":""},{"$f":"Eval_cout!M36","v":""},{"$f":"Eval_cout!N36","v":""},{"$f":"Eval_cout!O36","v":""},{"$f":"Eval_cout!P36","v":""},{"$f":"Eval_cout!Q36","v":""},null,{"$f":"Eval_cout!S36","v":false},null,null,null,null,null,null,null,null,null,null,null,null,false,"ok","ok","ok","ok","ok","ok","ok","ok","ok","ok"]
[]
[]
[]
[]
[]
[]
[]
[]
[]
[null,null,null,null,null,null,null,null,null,null,null,null,null,null,null,null,null,null,null,{"$f":"COUNTIF(T40:T42,\"<>n/a\"\n)","v":1},{"$f":"COUNTIF(U39:AD39,\"<>n/a\"\n)","v":0}]
[null,null,null,"Environnement (local)",null,null,null,null,null,null,null,null,null,null,null,null,null,null,null,null,{"$f":"H19","v":"n/a"},{"$f":"I19","v":"n/a"},{"$f":"J19","v":"n/a"},"n/a","n/a","n/a","n/a","n/a","n/a","n/a",null,{"$f":"COUNTIF(AG40:AP56,\"not ok\")","v":0},{"$f":"U39","v":"n/a"},"n/a","n/a","n/a","n/a","n/a","n/a","n/a","n/a","n/a"]
[null,null,null,"Cote liée au pourcentage de charge polluante éliminé",null,"Min","Unité",{"$f":"Eval_env!H22","v":""},{"$f":"Eval_env!I22","v":""},{"$f":"Eval_env!J22","v":""},{"$f":"Eval_env!K22","v":""},{"$f":"Eval_env!L22","v":""},{"$f":"Eval_env!M22","v":""},{"$f":"Eval_env!N22","v":""},{"$f":"Eval_env!O22","v":""},{"$f":"Eval_env!P22","v":""},{"$f":"Eval_env!Q22","v":""},null,{"$f":"Eval_env!S22","v":true},"Cote liée au pourcentage de charge polluante éliminé",{"$f":"VLOOKUP($T40,$D$40:$Q$56,4+MATCH(U$39,$U$39:$AD$39,0),0)","v":""},"","","","","","","","","",null,{"$f":"S40","v":true},{"$f":"IF(ISBLANK(H40), IF( OR(AG$21=\"n/a\",$AF40=FALSE,$AF40=0),\"ok\",\"not ok\"),\"ok\")","v":"ok"},{"$f":"IF(ISBLANK(I40), IF( OR(AH$21=\"n/a\",$AF40=FALSE,$AF40=0),\"ok\",\"not ok\"),\"ok\")","v":"ok"},{"$f":"IF(ISBLANK(J40), IF( OR(AI$21=\"n/a\",$AF40=FALSE,$AF40=0),\"ok\",\"not ok\"),\"ok\")","v":"ok"},{"$f":"IF(ISBLANK(K40), IF( OR(AJ$21=\"n/a\",$AF40=FALSE,$AF40=0),\"ok\",\"not ok\"),\"ok\")","v":"ok"},{"$f":"IF(ISBLANK(L40), IF( OR(AK$21=\"n/a\",$AF40=FALSE,$AF40=0),\"ok\",\"not ok\"),\"ok\")","v":"ok"},{"$f":"IF(ISBLANK(M40), IF( OR(AL$21=\"n/a\",$AF40=FALSE,$AF40=0),\"ok\",\"not ok\"),\"ok\")","v":"ok"},{"$f":"IF(ISBLANK(N40), IF( OR(AM$21=\"n/a\",$AF40=FALSE,$AF40=0),\"ok\",\"not ok\"),\"ok\")","v":"ok"},{"$f":"IF(ISBLANK(O40), IF( OR(AN$21=\"n/a\",$AF40=FALSE,$AF40=0),\"ok\",\"not ok\"),\"ok\")","v":"ok"},{"$f":"IF(ISBLANK(P40), IF( OR(AO$21=\"n/a\",$AF40=FALSE,$AF40=0),\"ok\",\"not ok\"),\"ok\")","v":"ok"},{"$f":"IF(ISBLANK(Q40), IF( OR(AP$21=\"n/a\",$AF40=FALSE,$AF40=0),\"ok\",\"not ok\"),\"ok\")","v":"ok"}]
[null,null,null,null,null,null,null,null,null,null,null,null,null,null,null,null,null,null,null,"n/a",{"$error":"#N/A"},{"$error":"#N/A"},{"$error":"#N/A"},{"$error":"#N/A"},{"$error":"#N/A"},{"$error":"#N/A"},{"$error":"#N/A"},{"$error":"#N/A"},{"$error":"#N/A"},{"$error":"#N/A"},null,0,{"$f":"IF(ISBLANK(H41), IF( OR(AG$21=\"n/a\",$AF41=FALSE,$AF41=0),\"ok\",\"not ok\"),\"ok\")","v":"ok"},"ok","ok","ok","ok","ok","ok","ok","ok","ok"]
[null,null,null,"Impact sur la biodiversité",null,"Min","Unité",{"$f":"Eval_env!H28","v":""},{"$f":"Eval_env!I28","v":""},{"$f":"Eval_env!J28","v":""},{"$f":"Eval_env!K28","v":""},{"$f":"Eval_env!L28","v":""},{"$f":"Eval_env!M28","v":""},{"$f":"Eval_env!N28","v":""},{"$f":"Eval_env!O28","v":""},{"$f":"Eval_env!P28","v":""},{"$f":"Eval_env!Q28","v":""},null,{"$f":"Eval_env!S28","v":false},"n/a",{"$error":"#N/A"},{"$error":"#N/A"},{"$error":"#N/A"},{"$error":"#N/A"},{"$error":"#N/A"},{"$error":"#N/A"},{"$error":"#N/A"},{"$error":"#N/A"},{"$error":"#N/A"},{"$error":"#N/A"},null,false,"ok","ok","ok","ok","ok","ok","ok","ok","ok","ok"]
[null,null,null,null,null,null,null,null,null,null,null,null,null,null,null,null,null,null,null,"n/a",{"$error":"#N/A"},{"$error":"#N/A"},{"$error":"#N/A"},{"$error":"#N/A"},{"$error":"#N/A"},{"$error":"#N/A"},{"$error":"#N/A"},{"$error":"#N/A"},{"$error":"#N/A"},{"$error":"#N/A"},null,0,"ok","ok","ok","ok","ok","ok","ok","ok","ok","ok"]
[null,null,null,"Risque de mobilisation du polluant (vers eau ou air).",null,"Min","Unité",{"$f":"Eval_env!H33","v":""},{"$f":"Eval_env!I33","v":""},{"$f":"Eval_env!J33","v":""},{"$f":"Eval_env!K33","v":""},{"$f":"Eval_env!L33","v":""},{"$f":"Eval_env!M33","v":""},{"$f":"Eval_env!N33","v":""},{"$f":"Eval_env!O33","v":""},{"$f":"Eval_env!P33","v":""},{"$f":"Eval_env!Q33","v":""},null,{"$f":"Eval_env!S33","v":false},"n/a",null,null,null,null,null,null,null,null,null,null,null,false,"ok","ok","ok","ok","ok","ok","ok","ok","ok","ok"]
[]
[null,null,null,null,null,null,null,null,null,null,null,null,null,null,null,null,null,null,true]
[]
[null,null,null,null,null,null,null,null,null,null,null,null,null,null,null,null,null,null,true]
[]
[null,null,null,null,null,null,null,null,null,null,null,null,null,null,null,null,null,null,true]
[]
[null,null,null,null,null,null,null,null,null,null,null,null,null,null,null,null,null,null,true]
[null,null,null,null,null,null,null,null,null,null,null,null,null,null,null,null,null,null,null,"rows","columns"]
[null,null,null,null,null,null,null,null,null,null,null,null,null,null,null,null,null,null,true,{"$f":"COUNTIF(T56:T58,\"<>n/a\")","v":1},{"$f":"COUNTIF(U55:AD55,\"<>n/a\"\n)","v":0}]
[null,null,null,"Environnement (global)",null,null,null,null,null,null,null,null,null,null,null,null,null,null,null,{"$f":"D55","v":"Environnement (global)"},{"$f":"H19","v":"n/a"},"n/a","n/a","n/a","n/a","n/a","n/a","n/a","n/a","n/a",null,{"$f":"COUNTIF(AG58:AP76,\"not ok\")","v":0},{"$f":"U55","v":"n/a"},"n/a","n/a","n/a","n/a","n/a","n/a","n/a","n/a","n/a"]
[null,null,null,"Restauration de la fonctionnalité du sol.",null,"Min","Unité",{"$f":"Eval_env!H40","v":""},{"$f":"Eval_env!I40","v":""},{"$f":"Eval_env!J40","v":""},{"$f":"Eval_env!K40","v":""},{"$f":"Eval_env!L40","v":""},{"$f":"Eval_env!M40","v":""},{"$f":"Eval_env!N40","v":""},{"$f":"Eval_env!O40","v":""},{"$f":"Eval_env!P40","v":""},{"$f":"Eval_env!Q40","v":""},null,{"$f":"Eval_env!S40","v":false},"Bilan écologique (eau, déchets, émissions)",{"$f":"VLOOKUP($T56,$D$56:$Q$62,4+MATCH(U$55,$U$55:$AD$55,0),0)","v":""},{"$f":"VLOOKUP($T56,$D$56:$Q$62,4+MATCH(V$55,$U$55:$AD$55,0),0)","v":""},"","","","","","","","",null,{"$f":"S56","v":false},{"$f":"IF(ISBLANK(H56), IF( OR(AG$21=\"n/a\",$AF56=FALSE,$AF56=0),\"ok\",\"not ok\"),\"ok\")","v":"ok"},"ok","ok","ok","ok","ok","ok","ok","ok","ok"]
[null,null,null,null,null,null,null,null,null,null,null,null,null,null,null,null,null,null,null,"n/a",{"$f":"VLOOKUP($T57,$D$56:$Q$62,4+MATCH(U$55,$U$55:$AD$55,0),0)","v":{"$error":"#N/A"}},{"$error":"#N/A"},{"$error":"#N/A"},{"$error":"#N/A"},{"$error":"#N/A"},{"$error":"#N/A"},{"$error":"#N/A"},{"$error":"#N/A"},{"$error":"#N/A"},{"$error":"#N/A"},null,{"$f":"S57","v":0},"ok","ok","ok","ok","ok","ok","ok","ok","ok","ok"]
[null,null,null,"Impact des actes et travaux sur les écosystèmes",null,"Min","Unité",{"$f":"Eval_env!H45","v":""},{"$f":"Eval_env!I45","v":""},{"$f":"Eval_env!J45","v":""},{"$f":"Eval_env!K45","v":""},{"$f":"Eval_env!L45","v":""},{"$f":"Eval_env!M45","v":""},{"$f":"Eval_env!N45","v":""},{"$f":"Eval_env!O45","v":""},{"$f":"Eval_env!P45","v":""},{"$f":"Eval_env!Q45","v":""},null,{"$f":"Eval_env!S45","v":false},"n/a",{"$error":"#N/A"},{"$error":"#N/A"},{"$error":"#N/A"},{"$error":"#N/A"},{"$error":"#N/A"},{"$error":"#N/A"},{"$error":"#N/A"},{"$error":"#N/A"},{"$error":"#N/A"},{"$error":"#N/A"},null,{"$f":"S58","v":false},{"$f":"IF(ISBLANK(H58), IF( OR(AG$21=\"n/a\",$AF58=FALSE,$AF58=0),\"ok\",\"not ok\"),\"ok\")","v":"ok"},"ok","ok","ok","ok","ok","ok","ok","ok","ok"]
[null,null,null,null,null,null,null,null,null,null,null,null,null,null,null,null,null,null,null,"Energie","","","","","","","","","","",null,{"$f":"S59","v":0},"ok","ok","ok","ok","ok","ok","ok","ok","ok","ok"]
[null,null,null,"Bilan écologique (eau, déchets, émissions)",null,"Min","Unité",{"$f":"Eval_env!H50","v":""},{"$f":"Eval_env!I50","v":""},{"$f":"Eval_env!J50","v":""},{"$f":"Eval_env!K50","v":""},{"$f":"Eval_env!L50","v":""},{"$f":"Eval_env!M50","v":""},{"$f":"Eval_env!N50","v":108},{"$f":"Eval_env!O50","v":""},{"$f":"Eval_env!P50","v":""},{"$f":"Eval_env!Q50","v":""},null,{"$f":"Eval_env!S50","v":true}]
[]
[null,null,null,"Energie",null,"Min","Unité",{"$f":"Eval_env!H67","v":""},{"$f":"Eval_env!I67","v":""},{"$f":"Eval_env!J67","v":""},{"$f":"Eval_env!K67","v":""},{"$f":"Eval_env!L67","v":""},{"$f":"Eval_env!M67","v":""},{"$f":"Eval_env!N67","v":""},{"$f":"Eval_env!O67","v":""},{"$f":"Eval_env!P67","v":""},{"$f":"Eval_env!Q67","v":""},null,{"$f":"Eval_env!S67","v":true}]
[]
[null,null,null,null,null,null,null,null,null,null,null,null,null,null,null,null,null,null,true]
[]
[null,null,null,null,null,null,null,null,null,null,null,null,null,null,null,null,null,null,true]
[]
[null,null,null,null,null,null,null,null,null,null,null,null,null,null,null,null,null,null,true]
[]
[null,null,null,null,null,null,null,null,null,null,null,null,null,null,null,null,null,null,true]
[]
[null,null,null,null,null,null,null,null,null,null,null,null,null,null,null,null,null,null,true,{"$f":"COUNTIF(T74:T75,\"<>n/a\")","v":2},{"$f":"COUNTIF(U73:AD73,\"<>n/a\"\n)","v":0}]
[null,null,null,"Social (local)",null,null,null,null,null,null,null,null,null,null,null,null,null,null,true,{"$f":"D73","v":"Social (local)"},{"$f":"H19","v":"n/a"},"n/a","n/a","n/a","n/a","n/a","n/a","n/a","n/a","n/a",null,{"$f":"COUNTIF(AG74:AP76,\"not ok\")","v":0},{"$f":"U73","v":"n/a"},"n/a","n/a","n/a","n/a","n/a","n/a","n/a","n/a","n/a"]
[null,null,null,"Nuisance environnementale sur chantier",null,"Min","Unité",{"$f":"Eval_soc!H22","v":""},{"$f":"Eval_soc!I22","v":""},{"$f":"Eval_soc!J22","v":""},{"$f":"Eval_soc!K22","v":""},{"$f":"Eval_soc!L22","v":""},{"$f":"Eval_soc!M22","v":""},{"$f":"Eval_soc!N22","v":""},{"$f":"Eval_soc!O22","v":""},{"$f":"Eval_soc!P22","v":""},{"$f":"Eval_soc!Q22","v":""},null,{"$f":"Eval_soc!S22","v":true},"Nuisance environnementale sur chantier",{"$f":"VLOOKUP($T74,$D$74:$Q$76,4+MATCH(U$73,$U$73:$AD$73,0),0)","v":""},"","","","","","","","","",null,{"$f":"S74","v":true},{"$f":"IF(ISBLANK(H74), IF( OR(AG$21=\"n/a\",$AF74=FALSE,$AF74=0),\"ok\",\"not ok\"),\"ok\")","v":"ok"},{"$f":"IF(ISBLANK(I74), IF( OR(AH$21=\"n/a\",$AF74=FALSE,$AF74=0),\"ok\",\"not ok\"),\"ok\")","v":"ok"},{"$f":"IF(ISBLANK(J74), IF( OR(AI$21=\"n/a\",$AF74=FALSE,$AF74=0),\"ok\",\"not ok\"),\"ok\")","v":"ok"},{"$f":"IF(ISBLANK(K74), IF( OR(AJ$21=\"n/a\",$AF74=FALSE,$AF74=0),\"ok\",\"not ok\"),\"ok\")","v":"ok"},{"$f":"IF(ISBLANK(L74), IF( OR(AK$21=\"n/a\",$AF74=FALSE,$AF74=0),\"ok\",\"not ok\"),\"ok\")","v":"ok"},{"$f":"IF(ISBLANK(M74), IF( OR(AL$21=\"n/a\",$AF74=FALSE,$AF74=0),\"ok\",\"not ok\"),\"ok\")","v":"ok"},{"$f":"IF(ISBLANK(N74), IF( OR(AM$21=\"n/a\",$AF74=FALSE,$AF74=0),\"ok\",\"not ok\"),\"ok\")","v":"ok"},{"$f":"IF(ISBLANK(O74), IF( OR(AN$21=\"n/a\",$AF74=FALSE,$AF74=0),\"ok\",\"not ok\"),\"ok\")","v":"ok"},{"$f":"IF(ISBLANK(P74), IF( OR(AO$21=\"n/a\",$AF74=FALSE,$AF74=0),\"ok\",\"not ok\"),\"ok\")","v":"ok"},{"$f":"IF(ISBLANK(Q74), IF( OR(AP$21=\"n/a\",$AF74=FALSE,$AF74=0),\"ok\",\"not ok\"),\"ok\")","v":"ok"}]
[null,null,null,null,null,null,null,null,null,null,null,null,null,null,null,null,null,null,null,"Nuisance environnementale liée au charroi","","","","","","","","","","",null,0,{"$f":"IF(ISBLANK(H75), IF( OR(AG$21=\"n/a\",$AF75=FALSE,$AF75=0),\"ok\",\"not ok\"),\"ok\")","v":"ok"},"ok","ok","ok","ok","ok","ok","ok","ok","ok"]
[null,null,null,"Nuisance environnementale liée au charroi",null,"Min","Unité",{"$f":"Eval_soc!H31","v":""},{"$f":"Eval_soc!I31","v":""},{"$f":"Eval_soc!J31","v":""},{"$f":"Eval_soc!K31","v":""},{"$f":"Eval_soc!L31","v":""},{"$f":"Eval_soc!M31","v":""},{"$f":"Eval_soc!N31","v":""},{"$f":"Eval_soc!O31","v":""},{"$f":"Eval_soc!P31","v":""},{"$f":"Eval_soc!Q31","v":""},null,{"$f":"Eval_soc!S31","v":true},"n/a",{"$error":"#N/A"},{"$error":"#N/A"},{"$error":"#N/A"},{"$error":"#N/A"},{"$error":"#N/A"},{"$error":"#N/A"},{"$error":"#N/A"},{"$error":"#N/A"},{"$error":"#N/A"},{"$error":"#N/A"},null,true,"ok","ok","ok","ok","ok","ok","ok","ok","ok","ok"]
[null,null,null,null,null,null,null,null,null,null,null,null,null,null,null,null,null,null,null,"n/a"]
[null,null,null,null,null,null,null,null,null,null,null,null,null,null,null,null,null,null,null,"n/a"]
[]
[]
[]
[]
[]
[]
[]
[null,null,null,null,null,null,null,null,null,null,null,null,null,null,null,null,null,null,null,{"$f":"COUNTIF(T88:T89,\"<>n/a\")","v":0},{"$f":"COUNTIF(U87:AD87,\"<>n/a\"\n)","v":0}]
[null,null,null,"Social (global)",null,null,null,null,null,null,null,null,null,null,null,null,null,null,null,{"$f":"D87","v":"Social (global)"},{"$f":"H19","v":"n/a"},"n/a","n/a","n/a","n/a","n/a","n/a","n/a","n/a","n/a",null,{"$f":"COUNTIF(AG88:AP106,\"not ok\")","v":0},{"$f":"U87","v":"n/a"},"n/a","n/a","n/a","n/a","n/a","n/a","n/a","n/a","n/a"]
[null,null,null,"Impact paysager",null,"Min","Unité",{"$f":"Eval_soc!H39","v":""},{"$f":"Eval_soc!I39","v":""},{"$f":"Eval_soc!J39","v":""},{"$f":"Eval_soc!K39","v":""},{"$f":"Eval_soc!L39","v":""},{"$f":"Eval_soc!M39","v":""},{"$f":"Eval_soc!N39","v":""},{"$f":"Eval_soc!O39","v":""},{"$f":"Eval_soc!P39","v":""},{"$f":"Eval_soc!Q39","v":""},null,{"$f":"Eval_soc!S39","v":false},"n/a",{"$f":"VLOOKUP($T88,$D$88:$Q$90,4+MATCH(U$87,$U$87:$AD$87,0),0)","v":{"$error":"#N/A"}},{"$error":"#N/A"},{"$error":"#N/A"},{"$error":"#N/A"},{"$error":"#N/A"},{"$error":"#N/A"},{"$error":"#N/A"},{"$error":"#N/A"},{"$error":"#N/A"},{"$error":"#N/A"},null,{"$f":"S88","v":false},{"$f":"IF(ISBLANK(H88), IF( OR(AG$21=\"n/a\",$AF88=FALSE,$AF88=0),\"ok\",\"not ok\"),\"ok\")","v":"ok"},"ok","ok","ok","ok","ok","ok","ok","ok","ok"]
[null,null,null,null,null,null,null,null,null,null,null,null,null,null,null,null,null,null,null,"n/a",{"$error":"#N/A"},{"$error":"#N/A"},{"$error":"#N/A"},{"$error":"#N/A"},{"$error":"#N/A"},{"$error":"#N/A"},{"$error":"#N/A"},{"$error":"#N/A"},{"$error":"#N/A"},{"$error":"#N/A"},null,{"$f":"S89","v":0},"ok","ok","ok","ok","ok","ok","ok","ok","ok","ok"]
[null,null,null,"Impact patrimonial",null,"Min","Unité",{"$f":"Eval_soc!H42","v":""},{"$f":"Eval_soc!I42","v":""},{"$f":"Eval_soc!J42","v":""},{"$f":"Eval_soc!K42","v":""},{"$f":"Eval_soc!L42","v":""},{"$f":"Eval_soc!M42","v":""},{"$f":"Eval_soc!N42","v":""},{"$f":"Eval_soc!O42","v":""},{"$f":"Eval_soc!P42","v":""},{"$f":"Eval_soc!Q42","v":""},null,{"$f":"Eval_soc!S42","v":false},null,null,null,null,null,null,null,null,null,null,null,null,false,"ok","ok","ok","ok","ok","ok","ok","ok","ok","ok"]
[null,null,null,null,null,null,null,null,null,null,null,null,null,null,null,null,null,null,null,"n/a"]
[null,null,null,null,null,null,null,null,null,null,null,null,null,null,null,null,null,null,null,"n/a"]
[null,null,null,null,null,null,null,null,null,null,null,null,null,null,null,null,null,null,null,"n/a"]
[null,null,null,null,null,null,null,null,null,null,null,null,null,null,null,null,null,null,null,"n/a"]
[null,null,null,null,null,null,null,null,null,null,null,null,null,null,null,null,null,null,null,"n/a"]

{"sheet":"Resultats","index":12,"n_rows":122,"n_cols":29,"rows_kept":122,"cut":false,"hidden":false,"merged":[[14,14,14,17],[15,14,15,17],[16,14,16,17],[17,14,17,17],[31,13,31,15],[40,13,40,15],[41,13,41,15],[42,13,42,15],[33,13,33,15],[34,13,34,15],[35,13,35,15],[36,13,36,15],[37,13,37,15],[11,14,11,17],[12,14,12,17],[13,14,13,17],[68,13,68,15],[65,13,65,15],[66,13,66,15],[57,13,57,15],[60,13,60,15],[61,13,61,15],[62,13,62,15],[63,13,63,15],[64,13,64,15],[67,13,67,15],[59,13,59,15],[38,13,38,15],[39,13,39,15]]}
[]
[]
[]
[]
[]
[]
[]
[]
[]
[]
[]
[]
[]
[]
[]
[]
[]
[]
[]
[]
[]
[]
[]
[null,null,"Classement général des variantes"]
[null,null,null,null,null,null,null,null,null,null,null,null,null,null,null,null,null,null,null,null,null,null,null,null,null,null,null,null,"choisissez"]
[null,null,null,null,null,null,null,null,null,null,null,null,null,null,null,null,null,null,null,null,null,null,null,null,null,null,null,null,"Numéro de variante"]
[null,null,"Classer les variantes suivant le…",null,null,3,null,null,null,null,null,null,null,null,null,null,null,null,null,null,null,null,null,null,null,null,null,null,"Résultat de variante"]
[]
[]
[]
[]
[null,null,null,null,null,null,null,null,null,null,null,null,"N°","Nom de la variante",null,null,"Score total"]
[]
[null,null,null,null,null,null,null,null,null,null,null,null,{"$f":"IF(OR(N34=\"n/a\",N34=\"\"),\"\",INDEX(Scenarios!$D$22:$D$40,MATCH(Resultats!N34,Scenarios!G$22:G$40,0)))","v":""},{"$f":"IF(D102=\"\",\"\",D104)","v":""},null,null,{"$f":"IF(D102=\"\",\"\",D103)","v":""},{"$f":"Q34","v":""},null,null,null,null,null,{"$f":"IF(M34=\"\",\"\",RIGHT(M34,LEN(M34)-9))","v":""}]
[null,null,null,null,null,null,null,null,null,null,null,null,{"$f":"IF(OR(N35=\"n/a\",N35=\"\"),\"\",INDEX(Scenarios!$D$22:$D$40,MATCH(Resultats!N35,Scenarios!G$22:G$40,0)))","v":""},{"$f":"IF(E102=\"\",\"\",E104)","v":""},null,null,{"$f":"IF(E102=\"\",\"\",E103)","v":""},"",null,null,null,null,null,{"$f":"IF(M35=\"\",\"\",RIGHT(M35,LEN(M35)-9))","v":""}]
[null,null,null,null,null,null,null,null,null,null,null,null,{"$f":"IF(OR(N36=\"n/a\",N36=\"\"),\"\",INDEX(Scenarios!$D$22:$D$40,MATCH(Resultats!N36,Scenarios!G$22:G$40,0)))","v":""},{"$f":"IF(F102=\"\",\"\",F104)","v":""},null,null,{"$f":"IF(F102=\"\",\"\",F103)","v":""},"",null,null,null,null,null,""]
[null,null,null,null,null,null,null,null,null,null,null,null,{"$f":"IF(OR(N37=\"n/a\",N37=\"\"),\"\",INDEX(Scenarios!$D$22:$D$40,MATCH(Resultats!N37,Scenarios!G$22:G$40,0)))","v":""},{"$f":"IF(G102=\"\",\"\",G104)","v":""},null,null,{"$f":"IF(G102=\"\",\"\",G103)","v":""},"",null,null,null,null,null,""]
[null,null,null,null,null,null,null,null,null,null,null,null,{"$f":"IF(OR(N38=\"n/a\",N38=\"\"),\"\",INDEX(Scenarios!$D$22:$D$40,MATCH(Resultats!N38,Scenarios!G$22:G$40,0)))","v":""},{"$f":"IF(H102=\"\",\"\",H104)","v":""},null,null,{"$f":"IF(H102=\"\",\"\",H103)","v":""},"",null,null,null,null,null,""]
[null,null,null,null,null,null,null,null,null,null,null,null,{"$f":"IF(OR(N39=\"n/a\",N39=\"\"),\"\",INDEX(Scenarios!$D$22:$D$40,MATCH(Resultats!N39,Scenarios!G$22:G$40,0)))","v":""},{"$f":"IF(I102=\"\",\"\",I104)","v":""},null,null,{"$f":"IF(I102=\"\",\"\",I103)","v":""},"",null,null,null,null,null,""]
[null,null,null,null,null,null,null,null,null,null,null,null,{"$f":"IF(OR(N40=\"n/a\",N40=\"\"),\"\",INDEX(Scenarios!$D$22:$D$40,MATCH(Resultats!N40,Scenarios!G$22:G$40,0)))","v":""},{"$f":"IF(J102=\"\",\"\",J104)","v":""},null,null,{"$f":"IF(J102=\"\",\"\",J103)","v":""},"",null,null,null,null,null,""]
[null,null,null,null,null,null,null,null,null,null,null,null,{"$f":"IF(OR(N41=\"n/a\",N41=\"\"),\"\",INDEX(Scenarios!$D$22:$D$40,MATCH(Resultats!N41,Scenarios!G$22:G$40,0)))","v":""},{"$f":"IF(K102=\"\",\"\",K104)","v":""},null,null,{"$f":"IF(K102=\"\",\"\",K103)","v":""},"",null,null,null,null,null,""]
[null,null,null,null,null,null,null,null,null,null,null,null,{"$f":"IF(OR(N42=\"n/a\",N42=\"\"),\"\",INDEX(Scenarios!$D$22:$D$40,MATCH(Resultats!N42,Scenarios!G$22:G$40,0)))","v":""},{"$f":"IF(L102=\"\",\"\",L104)","v":""},null,null,{"$f":"IF(L102=\"\",\"\",L103)","v":""},"",null,null,null,null,null,""]
[null,null,null,null,null,null,null,null,null,null,null,null,{"$f":"IF(OR(N43=\"n/a\",N43=\"\"),\"\",INDEX(Scenarios!$D$22:$D$40,MATCH(Resultats!N43,Scenarios!G$22:G$40,0)))","v":""},{"$f":"IF(M102=\"\",\"\",M104)","v":""},null,null,{"$f":"IF(M102=\"\",\"\",M103)","v":""},"",null,null,null,null,null,""]
[]
[]
[]
[]
[null,null,"Détail des dimensions d'analyse"]
[]
[]
[null,null,"Classer les variantes suivant le…",null,null,3]
[]
[null,null,"Dimension à considérer…",null,null,5]
[]
[]
[]
[null,null,{"$f":"IF(F53=2, \"K €\",\"\")","v":""}]
[null,null,null,null,null,null,null,null,null,null,null,null,"N° ","Nom de la variante",null,null,"Score total"]
[]
[null,null,null,null,null,null,null,null,null,null,null,null,{"$f":"IF(OR(N60=\"\",N60=\"n/a\"),\"\",INDEX(Scenarios!$D$22:$D$40,MATCH(Resultats!N60,Scenarios!G$22:G$40,0)))","v":""},{"$f":"D122","v":""},null,null,{"$f":"D121","v":""},{"$f":"Q60","v":""},null,null,null,null,{"$f":"SUM(#REF!)","v":{"$error":"#REF!"}},{"$f":"IF(M60=\"\",\"\",RIGHT(M60,LEN(M60)-9))","v":""}]
[null,null,null,null,null,null,null,null,null,null,null,null,{"$f":"IF(OR(N61=\"\",N61=\"n/a\"),\"\",INDEX(Scenarios!$D$22:$D$40,MATCH(Resultats!N61,Scenarios!G$22:G$40,0)))","v":""},{"$f":"E122","v":""},null,null,{"$f":"E121","v":""},"",null,null,null,null,null,{"$f":"IF(M61=\"\",\"\",RIGHT(M61,LEN(M61)-9))","v":""}]
[null,null,null,null,null,null,null,null,null,null,null,null,{"$f":"IF(OR(N62=\"\",N62=\"n/a\"),\"\",INDEX(Scenarios!$D$22:$D$40,MATCH(Resultats!N62,Scenarios!G$22:G$40,0)))","v":""},{"$f":"F122","v":""},null,null,{"$f":"F121","v":""},"",null,null,null,null,null,""]
[null,null,null,null,null,null,null,null,null,null,null,null,{"$f":"IF(OR(N63=\"\",N63=\"n/a\"),\"\",INDEX(Scenarios!$D$22:$D$40,MATCH(Resultats!N63,Scenarios!G$22:G$40,0)))","v":""},{"$f":"G122","v":""},null,null,{"$f":"G121","v":""},"",null,null,null,null,null,""]
[null,null,null,null,null,null,null,null,null,null,null,null,{"$f":"IF(OR(N64=\"\",N64=\"n/a\"),\"\",INDEX(Scenarios!$D$22:$D$40,MATCH(Resultats!N64,Scenarios!G$22:G$40,0)))","v":""},{"$f":"H122","v":""},null,null,{"$f":"H121","v":""},"",null,null,null,null,null,""]
[null,null,null,null,null,null,null,null,null,null,null,null,{"$f":"IF(OR(N65=\"\",N65=\"n/a\"),\"\",INDEX(Scenarios!$D$22:$D$40,MATCH(Resultats!N65,Scenarios!G$22:G$40,0)))","v":""},{"$f":"I122","v":""},null,null,{"$f":"I121","v":""},"",null,null,null,null,null,""]
[null,null,null,null,null,null,null,null,null,null,null,null,{"$f":"IF(OR(N66=\"\",N66=\"n/a\"),\"\",INDEX(Scenarios!$D$22:$D$40,MATCH(Resultats!N66,Scenarios!G$22:G$40,0)))","v":""},{"$f":"J122","v":""},null,null,{"$f":"J121","v":""},"",null,null,null,null,null,""]
[null,null,null,null,null,null,null,null,null,null,null,null,{"$f":"IF(OR(N67=\"\",N67=\"n/a\"),\"\",INDEX(Scenarios!$D$22:$D$40,MATCH(Resultats!N67,Scenarios!G$22:G$40,0)))","v":""},{"$f":"K122","v":""},null,null,{"$f":"K121","v":""},"",null,null,null,null,null,""]
[null,null,null,null,null,null,null,null,null,null,null,null,{"$f":"IF(OR(N68=\"\",N68=\"n/a\"),\"\",INDEX(Scenarios!$D$22:$D$40,MATCH(Resultats!N68,Scenarios!G$22:G$40,0)))","v":""},{"$f":"L122","v":""},null,null,{"$f":"L121","v":""},"",null,null,null,null,null,""]
[null,null,null,null,null,null,null,null,null,null,null,null,{"$f":"IF(OR(N69=\"\",N69=\"n/a\"),\"\",INDEX(Scenarios!$D$22:$D$40,MATCH(Resultats!N69,Scenarios!G$22:G$40,0)))","v":""},{"$f":"M122","v":""},null,null,{"$f":"M121","v":""},"",null,null,null,null,null,""]
[]
[]
[]
[]
[]
[null,null,null,"Rows",{"$f":"COUNTIF(D77:M77,\"<>n/a\"\n)","v":0}]
[null,null,null,{"$f":"IF(D77=\"n/a\",2,1)","v":2},2,2,2,2,2,2,2,2,2]
[null,null,"choisissez une dimension",{"$f":"Scenarios!W2","v":"n/a"},{"$f":"Scenarios!X2","v":"n/a"},{"$f":"Scenarios!Y2","v":"n/a"},{"$f":"Scenarios!Z2","v":"n/a"},{"$f":"Scenarios!AA2","v":"n/a"},{"$f":"Scenarios!AB2","v":"n/a"},{"$f":"Scenarios!AC2","v":"n/a"},{"$f":"Scenarios!AD2","v":"n/a"},{"$f":"Scenarios!AE2","v":"n/a"},{"$f":"Scenarios!AF2","v":"n/a"}]
[null,null,"Coût",{"$f":"Coûts!G9","v":0},{"$f":"Coûts!H9","v":0},{"$f":"Coûts!I9","v":0},{"$f":"Coûts!J9","v":0},{"$f":"Coûts!K9","v":0},{"$f":"Coûts!L9","v":0},{"$f":"Coûts!M9","v":0},{"$f":"Coûts!N9","v":0},{"$f":"Coûts!O9","v":0},{"$f":"Coûts!P9","v":0}]
[null,null,"Environnement (local)",{"$f":"'Envi-Loc'!AQ12","v":0},{"$f":"'Envi-Loc'!AQ13","v":0},{"$f":"'Envi-Loc'!AQ14","v":0},{"$f":"'Envi-Loc'!AQ15","v":0},{"$f":"'Envi-Loc'!AQ16","v":0},{"$f":"'Envi-Loc'!AQ17","v":0},{"$f":"'Envi-Loc'!AQ18","v":0},{"$f":"'Envi-Loc'!AQ19","v":0},{"$f":"'Envi-Loc'!AQ20","v":0},{"$f":"'Envi-Loc'!AQ21","v":0}]
[null,null,"Environnement (global)",{"$f":"'Envi-Glob'!AQ14","v":0},{"$f":"'Envi-Glob'!AQ15","v":0},{"$f":"'Envi-Glob'!AQ16","v":0},{"$f":"'Envi-Glob'!AQ17","v":0},{"$f":"'Envi-Glob'!AQ18","v":0},{"$f":"'Envi-Glob'!AQ19","v":0},{"$f":"'Envi-Glob'!AQ20","v":0},{"$f":"'Envi-Glob'!AQ21","v":0},{"$f":"'Envi-Glob'!AQ22","v":0},{"$f":"'Envi-Glob'!AQ23","v":0}]
[null,null,"Environnement (global et local)",{"$f":"'Aggre - Envi'!AQ10","v":0},{"$f":"'Aggre - Envi'!AQ11","v":0},{"$f":"'Aggre - Envi'!AQ12","v":0},{"$f":"'Aggre - Envi'!AQ13","v":0},{"$f":"'Aggre - Envi'!AQ14","v":0},{"$f":"'Aggre - Envi'!AQ15","v":0},{"$f":"'Aggre - Envi'!AQ16","v":0},{"$f":"'Aggre - Envi'!AQ17","v":0},{"$f":"'Aggre - Envi'!AQ18","v":0},{"$f":"'Aggre - Envi'!AQ19","v":0}]
[null,null,"Social (local)",{"$f":"'Soc-Loc'!AQ11","v":0},{"$f":"'Soc-Loc'!AQ12","v":0},{"$f":"'Soc-Loc'!AQ13","v":0},{"$f":"'Soc-Loc'!AQ14","v":0},{"$f":"'Soc-Loc'!AQ15","v":0},{"$f":"'Soc-Loc'!AQ16","v":0},{"$f":"'Soc-Loc'!AQ17","v":0},{"$f":"'Soc-Loc'!AQ18","v":0},{"$f":"'Soc-Loc'!AQ19","v":0},{"$f":"'Soc-Loc'!AQ20","v":0}]
[null,null,"Social (global)",{"$f":"'Soc-Glob'!AQ11","v":0},{"$f":"'Soc-Glob'!AR11","v":0},{"$f":"'Soc-Glob'!AQ13","v":0},{"$f":"'Soc-Glob'!AQ14","v":0},{"$f":"'Soc-Glob'!AQ15","v":0},{"$f":"'Soc-Glob'!AQ16","v":0},{"$f":"'Soc-Glob'!AQ17","v":0},{"$f":"'Soc-Glob'!AQ18","v":0},{"$f":"'Soc-Glob'!AQ19","v":0},{"$f":"'Soc-Glob'!AQ20","v":0}]
[null,null,"Social (global et local)",{"$f":"'Aggre - Soc'!AQ12","v":0},{"$f":"'Aggre - Soc'!AQ13","v":0},{"$f":"'Aggre - Soc'!AQ14","v":0},{"$f":"'Aggre - Soc'!AQ15","v":0},{"$f":"'Aggre - Soc'!AQ16","v":0},{"$f":"'Aggre - Soc'!AQ17","v":0},{"$f":"'Aggre - Soc'!AQ18","v":0},{"$f":"'Aggre - Soc'!AQ19","v":0},{"$f":"'Aggre - Soc'!AQ20","v":0},{"$f":"'Aggre - Soc'!AQ21","v":0}]
[null,null,"Effets économiques",2.58,1.34,2.0299999999999998,-1.38,-1.89,-2.68,1.62612637562657,0.221096130751297,3.9483603582332001,1.9192224968168901]
[null,null,"Score total",{"$f":"'Agg-Finale'!AQ12","v":0},{"$f":"'Agg-Finale'!AQ13","v":0},{"$f":"'Agg-Finale'!AQ14","v":0},{"$f":"'Agg-Finale'!AQ15","v":0},{"$f":"'Agg-Finale'!AQ16","v":0},{"$f":"'Agg-Finale'!AQ17","v":0},{"$f":"'Agg-Finale'!AQ18","v":0},{"$f":"'Agg-Finale'!AQ19","v":0},{"$f":"'Agg-Finale'!AQ20","v":0},{"$f":"'Agg-Finale'!AQ21","v":0}]
[null,null,null,{"$f":"Scenarios!W1","v":"n/a"},{"$f":"Scenarios!X1","v":"n/a"},{"$f":"Scenarios!Y1","v":"n/a"},{"$f":"Scenarios!Z1","v":"n/a"},{"$f":"Scenarios!AA1","v":"n/a"},{"$f":"Scenarios!AB1","v":"n/a"},{"$f":"Scenarios!AC1","v":"n/a"},{"$f":"Scenarios!AD1","v":"n/a"},{"$f":"Scenarios!AE1","v":"n/a"},{"$f":"Scenarios!AF1","v":"n/a"}]
[]
[null,null,"CLASSEMENT TOTAL"]
[]
[null,null,{"$f":"10-COUNTIF(M34:M43,\"\")","v":0}]
[null,null,"Classement",{"$f":"IF(ISNUMBER(RANK(D94,$D$94:$M$94)),RANK(D94,$D$94:$M$94)+COUNTIF($D94:D$94,D94)-1,\"\")","v":""},{"$f":"IF(ISNUMBER(RANK(E94,$D$94:$M$94)),RANK(E94,$D$94:$M$94)+COUNTIF($D94:E$94,E94)-1,\"\")","v":""},{"$f":"IF(ISNUMBER(RANK(F94,$D$94:$M$94)),RANK(F94,$D$94:$M$94)+COUNTIF($D94:F$94,F94)-1,\"\")","v":""},{"$f":"IF(ISNUMBER(RANK(G94,$D$94:$M$94)),RANK(G94,$D$94:$M$94)+COUNTIF($D94:G$94,G94)-1,\"\")","v":""},{"$f":"IF(ISNUMBER(RANK(H94,$D$94:$M$94)),RANK(H94,$D$94:$M$94)+COUNTIF($D94:H$94,H94)-1,\"\")","v":""},{"$f":"IF(ISNUMBER(RANK(I94,$D$94:$M$94)),RANK(I94,$D$94:$M$94)+COUNTIF($D94:I$94,I94)-1,\"\")","v":""},{"$f":"IF(ISNUMBER(RANK(J94,$D$94:$M$94)),RANK(J94,$D$94:$M$94)+COUNTIF($D94:J$94,J94)-1,\"\")","v":""},{"$f":"IF(ISNUMBER(RANK(K94,$D$94:$M$94)),RANK(K94,$D$94:$M$94)+COUNTIF($D94:K$94,K94)-1,\"\")","v":""},{"$f":"IF(ISNUMBER(RANK(L94,$D$94:$M$94)),RANK(L94,$D$94:$M$94)+COUNTIF($D94:L$94,L94)-1,\"\")","v":""},{"$f":"IF(ISNUMBER(RANK(M94,$D$94:$M$94)),RANK(M94,$D$94:$M$94)+COUNTIF($D94:M$94,M94)-1,\"\")","v":""}]
[null,null,"Numéro de variante",{"$f":"IF(D77=\"n/a\",\"\",D77)","v":""},{"$f":"IF(E77=\"n/a\",\"\",E77)","v":""},"","","","","","","",""]
[null,null,"Score total",{"$f":"IF(D76=1,ROUND(D86,2),\"\")","v":""},{"$f":"IF(E76=1,ROUND(E86,2),\"\")","v":""},"","","","","","","",""]
[]
[null,null,"Rang de variante",1,2,3,4,5,6,7,8,9,10]
[null,null,"Résultat de variante",{"$f":"IFERROR(HLOOKUP(D96,$D$92:$M$94,2,0),\"\")","v":""},{"$f":"IFERROR(HLOOKUP(E96,$D$92:$M$94,2,0),\"\")","v":""},"","","","","","","",""]
[null,null,"Score total",{"$f":"IF(ISNUMBER(HLOOKUP(D96,$D$92:$M$94,3,0)),HLOOKUP(D96,$D$92:$M$94,3,0),\"\")","v":""},{"$f":"IF(ISNUMBER(HLOOKUP(E96,$D$92:$M$94,3,0)),HLOOKUP(E96,$D$92:$M$94,3,0),\"\")","v":""},"","","","","","","",""]
[]
[]
[null,null,"Tableau total variante"]
[null,null,{"$f":"IF(F27=3, \"Résultat de variante\", IF(F27=2, \"Numéro de variante\",\"n/a\"))","v":"Résultat de variante"},{"$f":"IF($C102=\"n/a\",\"n/a\",IF($C102=$C93,D93,D97))","v":""},{"$f":"IF($C102=\"n/a\",\"n/a\",IF($C102=$C93,E93,E97))","v":""},"","","","","","","",""]
[null,null,null,{"$f":"IF($C102=\"n/a\",0,IF($C102=$C93,D94,D98))","v":""},{"$f":"IF($C102=\"n/a\",0,IF($C102=$C93,E94,E98))","v":""},"","","","","","","",""]
[null,null,null,{"$f":"IF(D102=\"\",\"\",HLOOKUP(D102,$D$77:$M$87,11,0))","v":""},"","","","","","","","",""]
[]
[]
[]
[null,null,{"$f":"INDEX(C77:C86,F53)","v":"Environnement (global et local)"}]
[]
[null,null,"Classement",{"$f":"IF($C$108=\"Coût\",IF(ISNUMBER(RANK(D112,$D$112:$M$112)),nbvar-RANK(D112,$D$112:$M$112)+COUNTIF($D112:D$112,D112),\"\"),IF(ISNUMBER(RANK(D112,$D$112:$M$112)),RANK(D112,$D$112:$M$112)+COUNTIF($D112:D$112,D112)-1,\"\"))","v":""},{"$f":"IF($C$108=\"Coût\",IF(ISNUMBER(RANK(E112,$D$112:$M$112)),nbvar-RANK(E112,$D$112:$M$112)+COUNTIF($D112:E$112,E112),\"\"),IF(ISNUMBER(RANK(E112,$D$112:$M$112)),RANK(E112,$D$112:$M$112)+COUNTIF($D112:E$112,E112)-1,\"\"))","v":""},{"$f":"IF($C$108=\"Coût\",IF(ISNUMBER(RANK(F112,$D$112:$M$112)),nbvar-RANK(F112,$D$112:$M$112)+COUNTIF($D112:F$112,F112),\"\"),IF(ISNUMBER(RANK(F112,$D$112:$M$112)),RANK(F112,$D$112:$M$112)+COUNTIF($D112:F$112,F112)-1,\"\"))","v":""},{"$f":"IF($C$108=\"Coût\",IF(ISNUMBER(RANK(G112,$D$112:$M$112)),nbvar-RANK(G112,$D$112:$M$112)+COUNTIF($D112:G$112,G112),\"\"),IF(ISNUMBER(RANK(G112,$D$112:$M$112)),RANK(G112,$D$112:$M$112)+COUNTIF($D112:G$112,G112)-1,\"\"))","v":""},{"$f":"IF($C$108=\"Coût\",IF(ISNUMBER(RANK(H112,$D$112:$M$112)),nbvar-RANK(H112,$D$112:$M$112)+COUNTIF($D112:H$112,H112),\"\"),IF(ISNUMBER(RANK(H112,$D$112:$M$112)),RANK(H112,$D$112:$M$112)+COUNTIF($D112:H$112,H112)-1,\"\"))","v":""},{"$f":"IF($C$108=\"Coût\",IF(ISNUMBER(RANK(I112,$D$112:$M$112)),nbvar-RANK(I112,$D$112:$M$112)+COUNTIF($D112:I$112,I112),\"\"),IF(ISNUMBER(RANK(I112,$D$112:$M$112)),RANK(I112,$D$112:$M$112)+COUNTIF($D112:I$112,I112)-1,\"\"))","v":""},{"$f":"IF($C$108=\"Coût\",IF(ISNUMBER(RANK(J112,$D$112:$M$112)),nbvar-RANK(J112,$D$112:$M$112)+COUNTIF($D112:J$112,J112),\"\"),IF(ISNUMBER(RANK(J112,$D$112:$M$112)),RANK(J112,$D$112:$M$112)+COUNTIF($D112:J$112,J112)-1,\"\"))","v":""},{"$f":"IF($C$108=\"Coût\",IF(ISNUMBER(RANK(K112,$D$112:$M$112)),nbvar-RANK(K112,$D$112:$M$112)+COUNTIF($D112:K$112,K112),\"\"),IF(ISNUMBER(RANK(K112,$D$112:$M$112)),RANK(K112,$D$112:$M$112)+COUNTIF($D112:K$112,K112)-1,\"\"))","v":""},{"$f":"IF($C$108=\"Coût\",IF(ISNUMBER(RANK(L112,$D$112:$M$112)),nbvar-RANK(L112,$D$112:$M$112)+COUNTIF($D112:L$112,L112),\"\"),IF(ISNUMBER(RANK(L112,$D$112:$M$112)),RANK(L112,$D$112:$M$112)+COUNTIF($D112:L$112,L112)-1,\"\"))","v":""},{"$f":"IF($C$108=\"Coût\",IF(ISNUMBER(RANK(M112,$D$112:$M$112)),nbvar-RANK(M112,$D$112:$M$112)+COUNTIF($D112:M$112,M112),\"\"),IF(ISNUMBER(RANK(M112,$D$112:$M$112)),RANK(M112,$D$112:$M$112)+COUNTIF($D112:M$112,M112)-1,\"\"))","v":""}]
[null,null,"Numéro de variante",{"$f":"IF(D76=1,D77,\"\")","v":""},{"$f":"IF(E76=1,E77,\"\")","v":""},"","","","","","","",""]
[null,null,"Score total",{"$f":"IF(D76=2,\"\",ROUND(VLOOKUP($C$108,$C$78:$M$86,MATCH(D111,$D$77:$M$77,0)+1,0),2))","v":""},{"$f":"IF(E76=2,\"\",ROUND(VLOOKUP($C$108,$C$78:$M$86,MATCH(E111,$D$77:$M$77,0)+1,0),2))","v":""},"","","","","","","",""]
[]
[null,null,"Rang de variante",1,2,3,4,5,6,7,8,9,10]
[null,null,"Résultat d'évaluation",{"$f":"IFERROR(HLOOKUP(D114,$D$110:$M$112,2,0),\"\")","v":""},{"$f":"IFERROR(HLOOKUP(E114,$D$110:$M$112,2,0),\"\")","v":""},"","","","","","","",""]
[null,null,"Score total",{"$f":"IF(ISNUMBER(HLOOKUP(D114,$D$110:$M$112,3,0)),HLOOKUP(D114,$D$110:$M$112,3,0),\"\")","v":""},{"$f":"IF(ISNUMBER(HLOOKUP(E114,$D$110:$M$112,3,0)),HLOOKUP(E114,$D$110:$M$112,3,0),\"\")","v":""},"","","","","","","",""]
[]
[]
[null,null,"Tableau total variante"]
[null,null,{"$f":"IF(F51=1,\"n/a\",IF(F51=3, \"Résultat de variante\", \"Numéro de variante\"))","v":"Résultat de variante"},{"$f":"IF($C120=\"n/a\",\"n/a\",IF($C120=$C111,D111,D115))","v":""},{"$f":"IF($C120=\"n/a\",\"n/a\",IF($C120=$C111,E111,E115))","v":""},"","","","","","","",""]
[null,null,null,{"$f":"IF($C120=\"n/a\",0,IF($C120=$C111,D112,D116))","v":""},{"$f":"IF($C120=\"n/a\",0,IF($C120=$C111,E112,E116))","v":""},"","","","","","","",""]
[null,null,null,{"$f":"IF(D120=\"\",\"\",HLOOKUP(D120,$D$77:$M$87,11,0))","v":""},{"$f":"IF(E120=\"\",\"\",HLOOKUP(E120,$D$77:$M$87,11,0))","v":""},"","","","","","","",""]

{"sheet":"DonnéesFinales","index":13,"n_rows":40,"n_cols":20,"rows_kept":40,"cut":false,"hidden":true,"merged":[]}
[null,2,3,4,5,8,9,10,11,12,13,14,15,16,17,18,19]
[]
[]
[]
[]
[]
[]
[]
[]
[]
[]
[null,null,null,null,null,null,null,null,null,null,null,null,null,"Environnement","Social","Coût"]
[null,null,null,null,null,null,null,null,null,null,null,null,null,{"$f":"VLOOKUP(CONCATENATE(Accueil!$F$20,\",\",'Descriptif site'!$J$27,\",\",'Descriptif site'!$J$29),Pond_glob!$D$1:$G$37,2,0)","v":"Complétez les pages \"Accueil\" et \"Descriptif site\""},{"$f":"VLOOKUP(CONCATENATE(Accueil!$F$20,\",\",'Descriptif site'!$J$27,\",\",'Descriptif site'!$J$29),Pond_glob!$D$1:$G$37,3,0)","v":"Complétez les pages \"Accueil\" et \"Descriptif site\""},{"$f":"VLOOKUP(CONCATENATE(Accueil!$F$20,\",\",'Descriptif site'!$J$27,\",\",'Descriptif site'!$J$29),Pond_glob!$D$1:$G$37,4,0)","v":"Complétez les pages \"Accueil\" et \"Descriptif site\""}]
[null,null,null,null,null,null,null,null,null,null,null,null,null,null,null,"Vérifie les cellules activés",{"$f":"IF(ISNUMBER(SEARCH(\"pasvalscénarioact\",CONCATENATE(G18,H18,I18,J18,K18,L18,M18,#REF!,#REF!,#REF!))),1,0)","v":0}]
[null,null,null,null,null,null,null,null,null,null,null,null,null,null,null,null,"Max"]
[null,null,null,null,null,null,null,null,null,null,null,null,null,null,null,null,"Min"]
[]
[null,null,null,null,null,null,{"$f":"IF(AND(COUNTA(H22:H24,H27:H29,H32:H33,#REF!,#REF!,#REF!)<35,H20=1),\"pasvalscénarioact\",\"ok\")","v":"pasvalscénarioact"},{"$f":"IF(AND(COUNTA(I22:I24,I27:I29,I32:I33,#REF!,#REF!,#REF!)<35,I20=1),\"pasvalscénarioact\",\"ok\")","v":"ok"},{"$f":"IF(AND(COUNTA(J22:J24,J27:J29,J32:J33,#REF!,#REF!,#REF!)<35,J20=1),\"pasvalscénarioact\",\"ok\")","v":"ok"},{"$f":"IF(AND(COUNTA(K22:K24,K27:K29,K32:K33,#REF!,#REF!,#REF!)<35,K20=1),\"pasvalscénarioact\",\"ok\")","v":"ok"},{"$f":"IF(AND(COUNTA(L22:L24,L27:L29,L32:L33,#REF!,#REF!,#REF!)<35,L20=1),\"pasvalscénarioact\",\"ok\")","v":"ok"},{"$f":"IF(AND(COUNTA(M22:M24,M27:M29,M32:M33,#REF!,#REF!,#REF!)<35,M20=1),\"pasvalscénarioact\",\"ok\")","v":"ok"},{"$f":"IF(AND(COUNTA(#REF!,#REF!,#REF!,#REF!,#REF!,#REF!)<35,#REF!=1),\"pasvalscénarioact\",\"ok\")","v":{"$error":"#REF!"}}]
[null,null,null,"Catégorie/Indicateur",null,"Max /Min","Unité",{"$f":"Scenarios!W1","v":"n/a"},{"$f":"Scenarios!X1","v":"n/a"},{"$f":"Scenarios!Y1","v":"n/a"},{"$f":"Scenarios!Z1","v":"n/a"},{"$f":"Scenarios!AA1","v":"n/a"},{"$f":"Scenarios!AB1","v":"n/a"},{"$f":"Scenarios!AC1","v":"n/a"},{"$f":"Scenarios!AD1","v":"n/a"},{"$f":"Scenarios!AE1","v":"n/a"},{"$f":"Scenarios!AF1","v":"n/a"},{"$f":"S19","v":"Critère sélectioné?"},"Critère sélectioné?"]
[null,null,null,null,null,null,null,{"$f":"Scenarios!X22","v":1},{"$f":"Scenarios!X24","v":2},{"$f":"Scenarios!X26","v":3},{"$f":"Scenarios!X28","v":4},{"$f":"Scenarios!X30","v":5},{"$f":"Scenarios!X32","v":6},{"$f":"Scenarios!X40","v":10}]
[null,null,null,"Coût"]
[null,null,null,"Coût d’investissement et de fonctionnement",null,"Min","Unité",{"$f":"Synthese!H22","v":0},{"$f":"Synthese!I22","v":0},{"$f":"Synthese!J22","v":0},{"$f":"Synthese!K22","v":0},{"$f":"Synthese!L22","v":0},{"$f":"Synthese!M22","v":0},{"$f":"Synthese!N22","v":0},{"$f":"Synthese!O22","v":0},{"$f":"Synthese!P22","v":0},{"$f":"Synthese!Q22","v":0},{"$f":"S22","v":true},{"$f":"Synthese!S22","v":true}]
[null,null,null,"Coût de mesures de sécurité et de suivi",null,"Min","Unité",{"$f":"Synthese!H24","v":""},{"$f":"Synthese!I24","v":""},{"$f":"Synthese!J24","v":""},{"$f":"Synthese!K24","v":""},{"$f":"Synthese!L24","v":""},{"$f":"Synthese!M24","v":""},{"$f":"Synthese!N24","v":""},{"$f":"Synthese!O24","v":""},{"$f":"Synthese!P24","v":""},{"$f":"Synthese!Q24","v":""},{"$f":"S23","v":false},{"$f":"Synthese!S24","v":false}]
[null,null,null,"Coût des mesures complémentaires et compensatoires",null,"Min","Unité",{"$f":"Synthese!H26","v":""},{"$f":"Synthese!I26","v":""},{"$f":"Synthese!J26","v":""},{"$f":"Synthese!K26","v":""},{"$f":"Synthese!L26","v":""},{"$f":"Synthese!M26","v":""},{"$f":"Synthese!N26","v":""},{"$f":"Synthese!O26","v":""},{"$f":"Synthese!P26","v":""},{"$f":"Synthese!Q26","v":""},{"$f":"S24","v":false},{"$f":"Synthese!S26","v":false}]
[null,null,null,"Persistance de pollutions résiduelles et usage du terrain",null,"Min","Unité",{"$f":"Synthese!H28","v":""},{"$f":"Synthese!I28","v":""},{"$f":"Synthese!J28","v":""},{"$f":"Synthese!K28","v":""},{"$f":"Synthese!L28","v":""},{"$f":"Synthese!M28","v":""},{"$f":"Synthese!N28","v":""},{"$f":"Synthese!O28","v":""},{"$f":"Synthese!P28","v":""},{"$f":"Synthese!Q28","v":""},{"$f":"S25","v":false},{"$f":"Synthese!S28","v":false}]
[null,null,null,"Environnement (local)"]
[null,null,null,"Pourcentage de charge polluante éliminé",null,"Min","Unité",{"$f":"Synthese!H40","v":""},{"$f":"Synthese!I40","v":""},{"$f":"Synthese!J40","v":""},{"$f":"Synthese!K40","v":""},{"$f":"Synthese!L40","v":""},{"$f":"Synthese!M40","v":""},{"$f":"Synthese!N40","v":""},{"$f":"Synthese!O40","v":""},{"$f":"Synthese!P40","v":""},{"$f":"Synthese!Q40","v":""},{"$f":"S27","v":true},{"$f":"Synthese!S40","v":true}]
[null,null,null,"Impact des actes et travaux sur les écosystèmes",null,"Min","Unité",{"$f":"Synthese!H42","v":""},{"$f":"Synthese!I42","v":""},{"$f":"Synthese!J42","v":""},{"$f":"Synthese!K42","v":""},{"$f":"Synthese!L42","v":""},{"$f":"Synthese!M42","v":""},{"$f":"Synthese!N42","v":""},{"$f":"Synthese!O42","v":""},{"$f":"Synthese!P42","v":""},{"$f":"Synthese!Q42","v":""},{"$f":"S28","v":false},{"$f":"Synthese!S42","v":false}]
[null,null,null,"Risque de mobilisation du polluant (vers eau ou air).",null,"Min","Unité",{"$f":"Synthese!H44","v":""},{"$f":"Synthese!I44","v":""},{"$f":"Synthese!J44","v":""},{"$f":"Synthese!K44","v":""},{"$f":"Synthese!L44","v":""},{"$f":"Synthese!M44","v":""},{"$f":"Synthese!N44","v":""},{"$f":"Synthese!O44","v":""},{"$f":"Synthese!P44","v":""},{"$f":"Synthese!Q44","v":""},{"$f":"S29","v":false},{"$f":"Synthese!S44","v":false}]
[null,null,null,"Environnement (global)"]
[null,null,null,"Réstauration de la fonctionalité sol",null,"Min","Unité",{"$f":"Synthese!H56","v":""},{"$f":"Synthese!I56","v":""},{"$f":"Synthese!J56","v":""},{"$f":"Synthese!K56","v":""},{"$f":"Synthese!L56","v":""},{"$f":"Synthese!M56","v":""},{"$f":"Synthese!N56","v":""},{"$f":"Synthese!O56","v":""},{"$f":"Synthese!P56","v":""},{"$f":"Synthese!Q56","v":""},{"$f":"S31","v":false},{"$f":"Synthese!S56","v":false},"n/a"]
[null,null,null,"Impact sur la biodiversité",null,"Min","Unité",{"$f":"Synthese!H58","v":""},{"$f":"Synthese!I58","v":""},{"$f":"Synthese!J58","v":""},{"$f":"Synthese!K58","v":""},{"$f":"Synthese!L58","v":""},{"$f":"Synthese!M58","v":""},{"$f":"Synthese!N58","v":""},{"$f":"Synthese!O58","v":""},{"$f":"Synthese!P58","v":""},{"$f":"Synthese!Q58","v":""},{"$f":"S32","v":false},{"$f":"Synthese!S58","v":false},"n/a"]
[null,null,null,"Bilan écologique (eau énergie déchets émissions)",null,"Min","Unité",{"$f":"Synthese!H60","v":""},{"$f":"Synthese!I60","v":""},{"$f":"Synthese!J60","v":""},{"$f":"Synthese!K60","v":""},{"$f":"Synthese!L60","v":""},{"$f":"Synthese!M60","v":""},{"$f":"Synthese!N60","v":108},{"$f":"Synthese!O60","v":""},{"$f":"Synthese!P60","v":""},{"$f":"Synthese!Q60","v":""},{"$f":"S33","v":true},{"$f":"Synthese!S60","v":true}]
[null,null,null,"Energie",null,"Min","Unité",{"$f":"Synthese!H62","v":""},{"$f":"Synthese!I62","v":""},{"$f":"Synthese!J62","v":""},{"$f":"Synthese!K62","v":""},{"$f":"Synthese!L62","v":""},{"$f":"Synthese!M62","v":""},{"$f":"Synthese!N62","v":""},{"$f":"Synthese!O62","v":""},{"$f":"Synthese!P62","v":""},{"$f":"Synthese!Q62","v":""},{"$f":"S34","v":true},{"$f":"Synthese!S62","v":true}]
[null,null,null,"Social (local)"]
[null,null,null,"Nuisance environnementale sur chantier",null,"Min","Unité",{"$f":"Synthese!H74","v":""},{"$f":"Synthese!I74","v":""},{"$f":"Synthese!J74","v":""},{"$f":"Synthese!K74","v":""},{"$f":"Synthese!L74","v":""},{"$f":"Synthese!M74","v":""},{"$f":"Synthese!N74","v":""},{"$f":"Synthese!O74","v":""},{"$f":"Synthese!P74","v":""},{"$f":"Synthese!Q74","v":""},{"$f":"S36","v":true},{"$f":"Synthese!S74","v":true}]
[null,null,null,"Nuisance environnementale liée au charroi",null,"Min","Unité",{"$f":"Synthese!H76","v":""},{"$f":"Synthese!I76","v":""},{"$f":"Synthese!J76","v":""},{"$f":"Synthese!K76","v":""},{"$f":"Synthese!L76","v":""},{"$f":"Synthese!M76","v":""},{"$f":"Synthese!N76","v":""},{"$f":"Synthese!O76","v":""},{"$f":"Synthese!P76","v":""},{"$f":"Synthese!Q76","v":""},{"$f":"S37","v":true},{"$f":"Synthese!S76","v":true}]
[null,null,null,"Social (global)"]
[null,null,null,"Impact paysager",null,"Min","Unité",{"$f":"Synthese!H88","v":""},{"$f":"Synthese!I88","v":""},{"$f":"Synthese!J88","v":""},{"$f":"Synthese!K88","v":""},{"$f":"Synthese!L88","v":""},{"$f":"Synthese!M88","v":""},{"$f":"Synthese!N88","v":""},{"$f":"Synthese!O88","v":""},{"$f":"Synthese!P88","v":""},{"$f":"Synthese!Q88","v":""},{"$f":"S39","v":false},{"$f":"Synthese!S88","v":false}]
[null,null,null,"Impact patrimonial",null,"Min","Unité",{"$f":"Synthese!H90","v":""},{"$f":"Synthese!I90","v":""},{"$f":"Synthese!J90","v":""},{"$f":"Synthese!K90","v":""},{"$f":"Synthese!L90","v":""},{"$f":"Synthese!M90","v":""},{"$f":"Synthese!N90","v":""},{"$f":"Synthese!O90","v":""},{"$f":"Synthese!P90","v":""},{"$f":"Synthese!Q90","v":""},{"$f":"S40","v":false},{"$f":"Synthese!S90","v":false}]

{"sheet":"Pond_glob","index":14,"n_rows":37,"n_cols":7,"rows_kept":37,"cut":false,"hidden":true,"merged":[]}
["pollution nouvelle/historique","Urbain/périurbain/rural ou industriel","zone nature/hors zone nature","choix final","Environnement","Social","Coût"]
["pollution nouvelle","urbain","zone nature",{"$f":"CONCATENATE(A2,\",\",B2,\",\",C2)","v":"pollution nouvelle,urbain,zone nature"},0.48,0.35,0.17]
["pollution nouvelle","urbain","hors zone nature",{"$f":"CONCATENATE(A3,\",\",B3,\",\",C3)","v":"pollution nouvelle,urbain,hors zone nature"},0.45,0.38,0.17]
["pollution nouvelle","urbain","choisissez une option","pollution nouvelle,urbain,choisissez une option","Complétez les pages \"Accueil\" et \"Descriptif site\"","Complétez les pages \"Accueil\" et \"Descriptif site\"","Complétez les pages \"Accueil\" et \"Descriptif site\""]
["pollution nouvelle","périurbain / rural","zone nature","pollution nouvelle,périurbain / rural,zone nature",0.48,0.3,0.22]
["pollution nouvelle","périurbain / rural","hors zone nature","pollution nouvelle,périurbain / rural,hors zone nature",0.45,0.33,0.22]
["pollution nouvelle","périurbain / rural","choisissez une option","pollution nouvelle,périurbain / rural,choisissez une option","Complétez les pages \"Accueil\" et \"Descriptif site\"","Complétez les pages \"Accueil\" et \"Descriptif site\"","Complétez les pages \"Accueil\" et \"Descriptif site\""]
["pollution nouvelle","industriel","zone nature","pollution nouvelle,industriel,zone nature",0.48,0.22,0.3]
["pollution nouvelle","industriel","hors zone nature","pollution nouvelle,industriel,hors zone nature",0.45,0.25,0.3]
["pollution nouvelle","industriel","choisissez une option","pollution nouvelle,industriel,choisissez une option","Complétez les pages \"Accueil\" et \"Descriptif site\"","Complétez les pages \"Accueil\" et \"Descriptif site\"","Complétez les pages \"Accueil\" et \"Descriptif site\""]
["pollution nouvelle","choisissez une option","zone nature","pollution nouvelle,choisissez une option,zone nature","Complétez les pages \"Accueil\" et \"Descriptif site\"","Complétez les pages \"Accueil\" et \"Descriptif site\"","Complétez les pages \"Accueil\" et \"Descriptif site\""]
["pollution nouvelle","choisissez une option","hors zone nature","pollution nouvelle,choisissez une option,hors zone nature","Complétez les pages \"Accueil\" et \"Descriptif site\"","Complétez les pages \"Accueil\" et \"Descriptif site\"","Complétez les pages \"Accueil\" et \"Descriptif site\""]
["pollution nouvelle","choisissez une option","choisissez une option","pollution nouvelle,choisissez une option,choisissez une option","Complétez les pages \"Accueil\" et \"Descriptif site\"","Complétez les pages \"Accueil\" et \"Descriptif site\"","Complétez les pages \"Accueil\" et \"Descriptif site\""]
["pollution historique","urbain","zone nature","pollution historique,urbain,zone nature",0.4,0.32,0.28000000000000003]
["pollution historique","urbain","hors zone nature","pollution historique,urbain,hors zone nature",0.33,0.4,0.27]
["pollution historique","urbain","choisissez une option","pollution historique,urbain,choisissez une option","Complétez les pages \"Accueil\" et \"Descriptif site\"","Complétez les pages \"Accueil\" et \"Descriptif site\"","Complétez les pages \"Accueil\" et \"Descriptif site\""]
["pollution historique","périurbain / rural","zone nature","pollution historique,périurbain / rural,zone nature",0.4,0.27,0.33329999999999999]
["pollution historique","périurbain / rural","hors zone nature","pollution historique,périurbain / rural,hors zone nature",0.33329999999999999,0.33329999999999999,0.33329999999999999]
["pollution historique","périurbain / rural","choisissez une option","pollution historique,périurbain / rural,choisissez une option","Complétez les pages \"Accueil\" et \"Descriptif site\"","Complétez les pages \"Accueil\" et \"Descriptif site\"","Complétez les pages \"Accueil\" et \"Descriptif site\""]
["pollution historique","industriel","zone nature","pollution historique,industriel,zone nature",0.4,0.19,0.41]
["pollution historique","industriel","hors zone nature","pollution historique,industriel,hors zone nature",0.3,0.27,0.43]
["pollution historique","industriel","choisissez une option","pollution historique,industriel,choisissez une option","Complétez les pages \"Accueil\" et \"Descriptif site\"","Complétez les pages \"Accueil\" et \"Descriptif site\"","Complétez les pages \"Accueil\" et \"Descriptif site\""]
["pollution historique","choisissez une option","zone nature","pollution historique,choisissez une option,zone nature","Complétez les pages \"Accueil\" et \"Descriptif site\"","Complétez les pages \"Accueil\" et \"Descriptif site\"","Complétez les pages \"Accueil\" et \"Descriptif site\""]
["pollution historique","choisissez une option","hors zone nature","pollution historique,choisissez une option,hors zone nature","Complétez les pages \"Accueil\" et \"Descriptif site\"","Complétez les pages \"Accueil\" et \"Descriptif site\"","Complétez les pages \"Accueil\" et \"Descriptif site\""]
["pollution historique","choisissez une option","choisissez une option","pollution historique,choisissez une option,choisissez une option","Complétez les pages \"Accueil\" et \"Descriptif site\"","Complétez les pages \"Accueil\" et \"Descriptif site\"","Complétez les pages \"Accueil\" et \"Descriptif site\""]
["choisissez une option","urbain","zone nature","choisissez une option,urbain,zone nature","Complétez les pages \"Accueil\" et \"Descriptif site\"","Complétez les pages \"Accueil\" et \"Descriptif site\"","Complétez les pages \"Accueil\" et \"Descriptif site\""]
["choisissez une option","urbain","hors zone nature","choisissez une option,urbain,hors zone nature","Complétez les pages \"Accueil\" et \"Descriptif site\"","Complétez les pages \"Accueil\" et \"Descriptif site\"","Complétez les pages \"Accueil\" et \"Descriptif site\""]
["choisissez une option","urbain","choisissez une option","choisissez une option,urbain,choisissez une option","Complétez les pages \"Accueil\" et \"Descriptif site\"","Complétez les pages \"Accueil\" et \"Descriptif site\"","Complétez les pages \"Accueil\" et \"Descriptif site\""]
["choisissez une option","périurbain / rural","zone nature","choisissez une option,périurbain / rural,zone nature","Complétez les pages \"Accueil\" et \"Descriptif site\"","Complétez les pages \"Accueil\" et \"Descriptif site\"","Complétez les pages \"Accueil\" et \"Descriptif site\""]
["choisissez une option","périurbain / rural","hors zone nature","choisissez une option,périurbain / rural,hors zone nature","Complétez les pages \"Accueil\" et \"Descriptif site\"","Complétez les pages \"Accueil\" et \"Descriptif site\"","Complétez les pages \"Accueil\" et \"Descriptif site\""]
["choisissez une option","périurbain / rural","choisissez une option","choisissez une option,périurbain / rural,choisissez une option","Complétez les pages \"Accueil\" et \"Descriptif site\"","Complétez les pages \"Accueil\" et \"Descriptif site\"","Complétez les pages \"Accueil\" et \"Descriptif site\""]
["choisissez une option","industriel","zone nature","choisissez une option,industriel,zone nature","Complétez les pages \"Accueil\" et \"Descriptif site\"","Complétez les pages \"Accueil\" et \"Descriptif site\"","Complétez les pages \"Accueil\" et \"Descriptif site\""]
["choisissez une option","industriel","hors zone nature","choisissez une option,industriel,hors zone nature","Complétez les pages \"Accueil\" et \"Descriptif site\"","Complétez les pages \"Accueil\" et \"Descriptif site\"","Complétez les pages \"Accueil\" et \"Descriptif site\""]
["choisissez une option","industriel","choisissez une option","choisissez une option,industriel,choisissez une option","Complétez les pages \"Accueil\" et \"Descriptif site\"","Complétez les pages \"Accueil\" et \"Descriptif site\"","Complétez les pages \"Accueil\" et \"Descriptif site\""]
["choisissez une option","choisissez une option","zone nature","choisissez une option,choisissez une option,zone nature","Complétez les pages \"Accueil\" et \"Descriptif site\"","Complétez les pages \"Accueil\" et \"Descriptif site\"","Complétez les pages \"Accueil\" et \"Descriptif site\""]
["choisissez une option","choisissez une option","hors zone nature","choisissez une option,choisissez une option,hors zone nature","Complétez les pages \"Accueil\" et \"Descriptif site\"","Complétez les pages \"Accueil\" et \"Descriptif site\"","Complétez les pages \"Accueil\" et \"Descriptif site\""]
["choisissez une option","choisissez une option","choisissez une option","choisissez une option,choisissez une option,choisissez une option","Complétez les pages \"Accueil\" et \"Descriptif site\"","Complétez les pages \"Accueil\" et \"Descriptif site\"","Complétez les pages \"Accueil\" et \"Descriptif site\""]

{"sheet":"Agg-Finale","index":15,"n_rows":79,"n_cols":43,"rows_kept":79,"cut":false,"hidden":true,"merged":[[47,2,56,2],[58,2,67,2],[69,2,78,2],[22,2,31,2],[33,2,42,2],[1,2,1,38],[9,4,9,13],[9,16,9,25],[9,28,9,37],[11,2,20,2]]}
[]
[null,null,"AGGREGATION - TOTAL"]
[null,null,null,null,null,null,{"$f":"IF(G4=\"\",0,1)","v":0},0,0,0,0,0,0,0,0,0,{"$f":"SUM(G3:P3)","v":0}]
[null,null,null,null,null,null,{"$f":"IF(DonnéesFinales!H$19=\"n/a\",\"\",\"T1\")","v":""},{"$f":"IF(DonnéesFinales!I$19=\"n/a\",\"\",\"T2\")","v":""},{"$f":"IF(DonnéesFinales!J$19=\"n/a\",\"\",\"T3\")","v":""},{"$f":"IF(DonnéesFinales!K$19=\"n/a\",\"\",\"T4\")","v":""},{"$f":"IF(DonnéesFinales!L$19=\"n/a\",\"\",\"T5\")","v":""},{"$f":"IF(DonnéesFinales!M$19=\"n/a\",\"\",\"T6\")","v":""},{"$f":"IF(DonnéesFinales!N$19=\"n/a\",\"\",\"T7\")","v":""},{"$f":"IF(DonnéesFinales!O$19=\"n/a\",\"\",\"T8\")","v":""},{"$f":"IF(DonnéesFinales!P$19=\"n/a\",\"\",\"T9\")","v":""},{"$f":"IF(DonnéesFinales!Q$19=\"n/a\",\"\",\"T10\")","v":""}]
[null,null,{"$f":"Coûts!C2","v":"COÛT"},{"$f":"DonnéesFinales!P13","v":"Complétez les pages \"Accueil\" et \"Descriptif site\""},"Min","Unité",{"$f":"Coûts!G9","v":0},{"$f":"Coûts!H9","v":0},{"$f":"Coûts!I9","v":0},{"$f":"Coûts!J9","v":0},{"$f":"Coûts!K9","v":0},{"$f":"Coûts!L9","v":0},{"$f":"Coûts!M9","v":0},{"$f":"Coûts!N9","v":0},{"$f":"Coûts!O9","v":0},{"$f":"Coûts!P9","v":0}]
[null,null,{"$f":"'Aggre - Soc'!C2:AM2","v":"AGGREGATION - SOCIAL"},{"$f":"DonnéesFinales!O13","v":"Complétez les pages \"Accueil\" et \"Descriptif site\""},"Max","Unité",{"$f":"'Aggre - Soc'!AQ12","v":0},{"$f":"'Aggre - Soc'!AQ13","v":0},{"$f":"'Aggre - Soc'!AQ14","v":0},{"$f":"'Aggre - Soc'!AQ15","v":0},{"$f":"'Aggre - Soc'!AQ16","v":0},{"$f":"'Aggre - Soc'!AQ17","v":0},{"$f":"'Aggre - Soc'!AQ18","v":0},{"$f":"'Aggre - Soc'!AQ19","v":0},{"$f":"'Aggre - Soc'!AQ20","v":0},{"$f":"'Aggre - Soc'!AQ21","v":0}]
[null,null,{"$f":"'Aggre - Envi'!C2:AM2","v":"AGGREGATION - ENVIRONNEMENT"},{"$f":"DonnéesFinales!N13","v":"Complétez les pages \"Accueil\" et \"Descriptif site\""},"Max","Unité",{"$f":"'Aggre - Envi'!AQ10","v":0},{"$f":"'Aggre - Envi'!AQ11","v":0},{"$f":"'Aggre - Envi'!AQ12","v":0},{"$f":"'Aggre - Envi'!AQ13","v":0},{"$f":"'Aggre - Envi'!AQ14","v":0},{"$f":"'Aggre - Envi'!AQ15","v":0},{"$f":"'Aggre - Envi'!AQ16","v":0},{"$f":"'Aggre - Envi'!AQ17","v":0},{"$f":"'Aggre - Envi'!AQ18","v":0},{"$f":"'Aggre - Envi'!AQ19","v":0}]
[]
[]
[null,null,null,1,"ComSaraison Sar Saire dk(ai,bj)",null,null,null,null,null,null,null,null,null,null,2,"Fonction de Sréférence F(dk(ai,bj))",null,null,null,null,null,null,null,null,null,null,3,"Degrée de Sréférence π(a,b)",null,null,null,null,null,null,null,null,null,null,4,"Flots de surclassement ф(ai,x)"]
[null,null,null,null,{"$f":"G4","v":""},{"$f":"H4","v":""},"","","","","","","","",null,null,"S1","S2","S3","S4","S5","S6","S7","S8","S9","S10",null,null,{"$f":"AB12","v":""},{"$f":"AB13","v":""},{"$f":"AB14","v":""},{"$f":"AB15","v":""},{"$f":"AB16","v":""},{"$f":"AB17","v":""},{"$f":"AB18","v":""},{"$f":"AB19","v":""},{"$f":"AB20","v":""},{"$f":"AB21","v":""},null,null,"ф+(x,a)","ф-(a,x)","ф(a,x)"]
[null,{"$f":"$C$48","v":0},{"$f":"C5","v":"COÛT"},{"$f":"G4","v":""},0,{"$f":"-H5+G5","v":0},{"$f":"-I5+G5","v":0},{"$f":"-J5+G5","v":0},{"$f":"-K5+G5","v":0},{"$f":"-L5+G5","v":0},{"$f":"-M5+G5","v":0},{"$f":"-N5+G5","v":0},{"$f":"-O5+G5","v":0},{"$f":"-P5+G5","v":0},null,"S1",{"$f":"IF(E12>=0,0,1-EXP((-(E12^2))/(2*$B12^2)))","v":0},{"$f":"IF(F12>=0,0,1-EXP((-(F12^2))/(2*$B12^2)))","v":0},0,0,0,0,0,0,0,0,null,{"$f":"IF(DonnéesFinales!H$19=\"n/a\",\"\",\"T1\")","v":""},{"$f":"IF(OR($AB12=\"\",AC$11=\"\"),0,Q12*$D$5+Q23*$D$6+Q34*$D$7)","v":0},{"$f":"IF(OR($AB12=\"\",AD$11=\"\"),0,R12*$D$5+R23*$D$6+R34*$D$7)","v":0},0,0,0,0,0,0,0,0,null,"S1",{"$f":"(1/($Q$3-1))*SUM(AC12:AL12)","v":0},{"$f":"(1/($Q$3-1))*SUM(AC12:AC21)","v":0},{"$f":"AO12-AP12","v":0}]
[null,0,null,{"$f":"H4","v":""},{"$f":"-G5+H5","v":0},0,{"$f":"-I5+H5","v":0},{"$f":"-J5+H5","v":0},{"$f":"-K5+H5","v":0},{"$f":"-L5+H5","v":0},{"$f":"-M5+H5","v":0},{"$f":"-N5+H5","v":0},{"$f":"-O5+H5","v":0},{"$f":"-P5+H5","v":0},null,"S2",{"$f":"IF(E13>=0,0,1-EXP((-(E13^2))/(2*$B13^2)))","v":0},{"$f":"IF(F13>=0,0,1-EXP((-(F13^2))/(2*$B13^2)))","v":0},{"$f":"IF(G13>=0,0,1-EXP((-(G13^2))/(2*$B13^2)))","v":0},{"$f":"IF(H13>=0,0,1-EXP((-(H13^2))/(2*$B13^2)))","v":0},{"$f":"IF(I13>=0,0,1-EXP((-(I13^2))/(2*$B13^2)))","v":0},{"$f":"IF(J13>=0,0,1-EXP((-(J13^2))/(2*$B13^2)))","v":0},{"$f":"IF(K13>=0,0,1-EXP((-(K13^2))/(2*$B13^2)))","v":0},{"$f":"IF(L13>=0,0,1-EXP((-(L13^2))/(2*$B13^2)))","v":0},{"$f":"IF(M13>=0,0,1-EXP((-(M13^2))/(2*$B13^2)))","v":0},{"$f":"IF(N13>=0,0,1-EXP((-(N13^2))/(2*$B13^2)))","v":0},null,{"$f":"IF(DonnéesFinales!I$19=\"n/a\",\"\",\"T2\")","v":""},{"$f":"IF(OR($AB13=\"\",AC$11=\"\"),0,Q13*$D$5+Q24*$D$6+Q35*$D$7)","v":0},0,0,0,0,0,0,0,0,0,null,"S2",0,{"$f":"(1/($Q$3-1))*SUM(AD12:AD21)","v":0},{"$f":"AO13-AP13","v":0}]
[null,0,null,{"$f":"I4","v":""},{"$f":"-G5+I5","v":0},{"$f":"-H5+I5","v":0},0,{"$f":"-J5+I5","v":0},{"$f":"-K5+I5","v":0},{"$f":"-L5+I5","v":0},{"$f":"-M5+I5","v":0},{"$f":"-N5+I5","v":0},{"$f":"-O5+I5","v":0},{"$f":"-P5+I5","v":0},null,"S3",0,0,0,0,0,0,0,0,0,0,null,{"$f":"IF(DonnéesFinales!J$19=\"n/a\",\"\",\"T3\")","v":""},0,0,0,0,0,0,0,0,0,0,null,"S3",0,{"$f":"(1/($Q$3-1))*SUM(AE12:AE21)","v":0},0]
[null,0,null,{"$f":"J4","v":""},{"$f":"-G5+J5","v":0},{"$f":"-H5+J5","v":0},{"$f":"-I5+J5","v":0},0,{"$f":"-K5+J5","v":0},{"$f":"-L5+J5","v":0},{"$f":"-M5+J5","v":0},{"$f":"-N5+J5","v":0},{"$f":"-O5+J5","v":0},{"$f":"-P5+J5","v":0},null,"S4",0,0,0,0,0,0,0,0,0,0,null,{"$f":"IF(DonnéesFinales!K$19=\"n/a\",\"\",\"T4\")","v":""},0,0,0,0,0,0,0,0,0,0,null,"S4",0,{"$f":"(1/($Q$3-1))*SUM(AF12:AF21)","v":0},0]
[null,0,null,{"$f":"K4","v":""},{"$f":"-G5+K5","v":0},{"$f":"-H5+K5","v":0},{"$f":"-I5+K5","v":0},{"$f":"-J5+K5","v":0},0,{"$f":"-L5+K5","v":0},{"$f":"-M5+K5","v":0},{"$f":"-N5+K5","v":0},{"$f":"-O5+K5","v":0},{"$f":"-P5+K5","v":0},null,"S5",0,0,0,0,0,0,0,0,0,0,null,{"$f":"IF(DonnéesFinales!L$19=\"n/a\",\"\",\"T5\")","v":""},0,0,0,0,0,0,0,0,0,0,null,"S5",0,{"$f":"(1/($Q$3-1))*SUM(AG12:AG21)","v":0},0]
[null,0,null,{"$f":"L4","v":""},{"$f":"-G5+L5","v":0},{"$f":"-H5+L5","v":0},{"$f":"-I5+L5","v":0},{"$f":"-J5+L5","v":0},{"$f":"-K5+L5","v":0},0,{"$f":"-M5+L5","v":0},{"$f":"-N5+L5","v":0},{"$f":"-O5+L5","v":0},{"$f":"-P5+L5","v":0},null,"S6",0,0,0,0,0,0,0,0,0,0,null,{"$f":"IF(DonnéesFinales!M$19=\"n/a\",\"\",\"T6\")","v":""},0,0,0,0,0,0,0,0,0,0,null,"S6",0,{"$f":"(1/($Q$3-1))*SUM(AH12:AH21)","v":0},0]
[null,0,null,{"$f":"M4","v":""},{"$f":"-G5+M5","v":0},{"$f":"-H5+M5","v":0},{"$f":"-I5+M5","v":0},{"$f":"-J5+M5","v":0},{"$f":"-K5+M5","v":0},{"$f":"-L5+M5","v":0},0,{"$f":"-N5+M5","v":0},{"$f":"-O5+M5","v":0},{"$f":"-P5+M5","v":0},null,"S7",0,0,0,0,0,0,0,0,0,0,null,{"$f":"IF(DonnéesFinales!N$19=\"n/a\",\"\",\"T7\")","v":""},0,0,0,0,0,0,0,0,0,0,null,"S7",0,{"$f":"(1/($Q$3-1))*SUM(AI12:AI21)","v":0},0]
[null,0,null,{"$f":"N4","v":""},{"$f":"-G5+N5","v":0},{"$f":"-H5+N5","v":0},{"$f":"-I5+N5","v":0},{"$f":"-J5+N5","v":0},{"$f":"-K5+N5","v":0},{"$f":"-L5+N5","v":0},{"$f":"-M5+N5","v":0},0,{"$f":"-O5+N5","v":0},{"$f":"-P5+N5","v":0},null,"S8",0,0,0,0,0,0,0,0,0,0,null,{"$f":"IF(DonnéesFinales!O$19=\"n/a\",\"\",\"T8\")","v":""},0,0,0,0,0,0,0,0,0,0,null,"S8",0,{"$f":"(1/($Q$3-1))*SUM(AJ12:AJ21)","v":0},0]
[null,0,null,{"$f":"O4","v":""},{"$f":"-G5+O5","v":0},{"$f":"-H5+O5","v":0},{"$f":"-I5+O5","v":0},{"$f":"-J5+O5","v":0},{"$f":"-K5+O5","v":0},{"$f":"-L5+O5","v":0},{"$f":"-M5+O5","v":0},{"$f":"-N5+O5","v":0},0,{"$f":"-P5+O5","v":0},null,"S9",0,0,0,0,0,0,0,0,0,0,null,{"$f":"IF(DonnéesFinales!P$19=\"n/a\",\"\",\"T9\")","v":""},0,0,0,0,0,0,0,0,0,0,null,"S9",0,{"$f":"(1/($Q$3-1))*SUM(AK12:AK21)","v":0},0]
[null,0,null,{"$f":"P4","v":""},{"$f":"-G5+P5","v":0},{"$f":"-H5+P5","v":0},{"$f":"-I5+P5","v":0},{"$f":"-J5+P5","v":0},{"$f":"-K5+P5","v":0},{"$f":"-L5+P5","v":0},{"$f":"-M5+P5","v":0},{"$f":"-N5+P5","v":0},{"$f":"-O5+P5","v":0},0,null,"S10",0,0,0,0,0,0,0,0,0,0,null,{"$f":"IF(DonnéesFinales!Q$19=\"n/a\",\"\",\"T10\")","v":""},0,0,0,0,0,0,0,0,0,0,null,"S10",0,{"$f":"(1/($Q$3-1))*SUM(AL12:AL21)","v":0},0]
[]
[null,{"$f":"$C$59","v":0},{"$f":"C6","v":"AGGREGATION - SOCIAL"},{"$f":"G4","v":""},0,{"$f":"-H6+G6","v":0},{"$f":"-I6+G6","v":0},{"$f":"-J6+G6","v":0},{"$f":"-K6+G6","v":0},{"$f":"-L6+G6","v":0},{"$f":"-M6+G6","v":0},{"$f":"-N6+G6","v":0},{"$f":"-O6+G6","v":0},{"$f":"-P6+G6","v":0},null,"S1",{"$f":"IF(E23<=0,0,1-EXP((-(E23^2))/(2*$B23^2)))","v":0},{"$f":"IF(F23<=0,0,1-EXP((-(F23^2))/(2*$B23^2)))","v":0},0,0,0,0,0,0,0,0]
[null,0,null,{"$f":"H4","v":""},{"$f":"-G6+H6","v":0},0,{"$f":"-I6+H6","v":0},{"$f":"-J6+H6","v":0},{"$f":"-K6+H6","v":0},{"$f":"-L6+H6","v":0},{"$f":"-M6+H6","v":0},{"$f":"-N6+H6","v":0},{"$f":"-O6+H6","v":0},{"$f":"-P6+H6","v":0},null,"S2",{"$f":"IF(E24<=0,0,1-EXP((-(E24^2))/(2*$B24^2)))","v":0},{"$f":"IF(F24<=0,0,1-EXP((-(F24^2))/(2*$B24^2)))","v":0},{"$f":"IF(G24<=0,0,1-EXP((-(G24^2))/(2*$B24^2)))","v":0},{"$f":"IF(H24<=0,0,1-EXP((-(H24^2))/(2*$B24^2)))","v":0},{"$f":"IF(I24<=0,0,1-EXP((-(I24^2))/(2*$B24^2)))","v":0},{"$f":"IF(J24<=0,0,1-EXP((-(J24^2))/(2*$B24^2)))","v":0},{"$f":"IF(K24<=0,0,1-EXP((-(K24^2))/(2*$B24^2)))","v":0},{"$f":"IF(L24<=0,0,1-EXP((-(L24^2))/(2*$B24^2)))","v":0},{"$f":"IF(M24<=0,0,1-EXP((-(M24^2))/(2*$B24^2)))","v":0},{"$f":"IF(N24<=0,0,1-EXP((-(N24^2))/(2*$B24^2)))","v":0}]
[null,0,null,{"$f":"I4","v":""},{"$f":"-G6+I6","v":0},{"$f":"-H6+I6","v":0},0,{"$f":"-J6+I6","v":0},{"$f":"-K6+I6","v":0},{"$f":"-L6+I6","v":0},{"$f":"-M6+I6","v":0},{"$f":"-N6+I6","v":0},{"$f":"-O6+I6","v":0},{"$f":"-P6+I6","v":0},null,"S3",0,0,0,0,0,0,0,0,0,0]
[null,0,null,{"$f":"J4","v":""},{"$f":"-G6+J6","v":0},{"$f":"-H6+J6","v":0},{"$f":"-I6+J6","v":0},0,{"$f":"-K6+J6","v":0},{"$f":"-L6+J6","v":0},{"$f":"-M6+J6","v":0},{"$f":"-N6+J6","v":0},{"$f":"-O6+J6","v":0},{"$f":"-P6+J6","v":0},null,"S4",0,0,0,0,0,0,0,0,0,0]
[null,0,null,{"$f":"K4","v":""},{"$f":"-G6+K6","v":0},{"$f":"-H6+K6","v":0},{"$f":"-I6+K6","v":0},{"$f":"-J6+K6","v":0},0,{"$f":"-L6+K6","v":0},{"$f":"-M6+K6","v":0},{"$f":"-N6+K6","v":0},{"$f":"-O6+K6","v":0},{"$f":"-P6+K6","v":0},null,"S5",0,0,0,0,0,0,0,0,0,0]
[null,0,null,{"$f":"L4","v":""},{"$f":"-G6+L6","v":0},{"$f":"-H6+L6","v":0},{"$f":"-I6+L6","v":0},{"$f":"-J6+L6","v":0},{"$f":"-K6+L6","v":0},0,{"$f":"-M6+L6","v":0},{"$f":"-N6+L6","v":0},{"$f":"-O6+L6","v":0},{"$f":"-P6+L6","v":0},null,"S6",0,0,0,0,0,0,0,0,0,0]
[null,0,null,{"$f":"M4","v":""},{"$f":"-G6+M6","v":0},{"$f":"-H6+M6","v":0},{"$f":"-I6+M6","v":0},{"$f":"-J6+M6","v":0},{"$f":"-K6+M6","v":0},{"$f":"-L6+M6","v":0},0,{"$f":"-N6+M6","v":0},{"$f":"-O6+M6","v":0},{"$f":"-P6+M6","v":0},null,"S7",0,0,0,0,0,0,0,0,0,0]
[null,0,null,{"$f":"N4","v":""},{"$f":"-G6+N6","v":0},{"$f":"-H6+N6","v":0},{"$f":"-I6+N6","v":0},{"$f":"-J6+N6","v":0},{"$f":"-K6+N6","v":0},{"$f":"-L6+N6","v":0},{"$f":"-M6+N6","v":0},0,{"$f":"-O6+N6","v":0},{"$f":"-P6+N6","v":0},null,"S8",0,0,0,0,0,0,0,0,0,0]
[null,0,null,{"$f":"O4","v":""},{"$f":"-G6+O6","v":0},{"$f":"-H6+O6","v":0},{"$f":"-I6+O6","v":0},{"$f":"-J6+O6","v":0},{"$f":"-K6+O6","v":0},{"$f":"-L6+O6","v":0},{"$f":"-M6+O6","v":0},{"$f":"-N6+O6","v":0},0,{"$f":"-P6+O6","v":0},null,"S9",0,0,0,0,0,0,0,0,0,0]
[null,0,null,{"$f":"P4","v":""},{"$f":"-G6+P6","v":0},{"$f":"-H6+P6","v":0},{"$f":"-I6+P6","v":0},{"$f":"-J6+P6","v":0},{"$f":"-K6+P6","v":0},{"$f":"-L6+P6","v":0},{"$f":"-M6+P6","v":0},{"$f":"-N6+P6","v":0},{"$f":"-O6+P6","v":0},0,null,"S10",0,0,0,0,0,0,0,0,0,0]
[]
[null,{"$f":"$C$70","v":0},{"$f":"C7","v":"AGGREGATION - ENVIRONNEMENT"},{"$f":"G4","v":""},0,{"$f":"-H7+G7","v":0},{"$f":"-I7+G7","v":0},{"$f":"-J7+G7","v":0},{"$f":"-K7+G7","v":0},{"$f":"-L7+G7","v":0},{"$f":"-M7+G7","v":0},{"$f":"-N7+G7","v":0},{"$f":"-O7+G7","v":0},{"$f":"-P7+G7","v":0},null,"S1",{"$f":"IF(E34<=0,0,1-EXP((-(E34^2))/(2*$B34^2)))","v":0},{"$f":"IF(F34<=0,0,1-EXP((-(F34^2))/(2*$B34^2)))","v":0},0,0,0,0,0,0,0,0]
[null,0,null,{"$f":"H4","v":""},{"$f":"-G7+H7","v":0},0,{"$f":"-I7+H7","v":0},{"$f":"-J7+H7","v":0},{"$f":"-K7+H7","v":0},{"$f":"-L7+H7","v":0},{"$f":"-M7+H7","v":0},{"$f":"-N7+H7","v":0},{"$f":"-O7+H7","v":0},{"$f":"-P7+H7","v":0},null,"S2",{"$f":"IF(E35<=0,0,1-EXP((-(E35^2))/(2*$B35^2)))","v":0},{"$f":"IF(F35<=0,0,1-EXP((-(F35^2))/(2*$B35^2)))","v":0},{"$f":"IF(G35<=0,0,1-EXP((-(G35^2))/(2*$B35^2)))","v":0},{"$f":"IF(H35<=0,0,1-EXP((-(H35^2))/(2*$B35^2)))","v":0},{"$f":"IF(I35<=0,0,1-EXP((-(I35^2))/(2*$B35^2)))","v":0},{"$f":"IF(J35<=0,0,1-EXP((-(J35^2))/(2*$B35^2)))","v":0},{"$f":"IF(K35<=0,0,1-EXP((-(K35^2))/(2*$B35^2)))","v":0},{"$f":"IF(L35<=0,0,1-EXP((-(L35^2))/(2*$B35^2)))","v":0},{"$f":"IF(M35<=0,0,1-EXP((-(M35^2))/(2*$B35^2)))","v":0},{"$f":"IF(N35<=0,0,1-EXP((-(N35^2))/(2*$B35^2)))","v":0}]
[null,0,null,{"$f":"I4","v":""},{"$f":"-G7+I7","v":0},{"$f":"-H7+I7","v":0},0,{"$f":"-J7+I7","v":0},{"$f":"-K7+I7","v":0},{"$f":"-L7+I7","v":0},{"$f":"-M7+I7","v":0},{"$f":"-N7+I7","v":0},{"$f":"-O7+I7","v":0},{"$f":"-P7+I7","v":0},null,"S3",0,0,0,0,0,0,0,0,0,0]
[null,0,null,{"$f":"J4","v":""},{"$f":"-G7+J7","v":0},{"$f":"-H7+J7","v":0},{"$f":"-I7+J7","v":0},0,{"$f":"-K7+J7","v":0},{"$f":"-L7+J7","v":0},{"$f":"-M7+J7","v":0},{"$f":"-N7+J7","v":0},{"$f":"-O7+J7","v":0},{"$f":"-P7+J7","v":0},null,"S4",0,0,0,0,0,0,0,0,0,0]
[null,0,null,{"$f":"K4","v":""},{"$f":"-G7+K7","v":0},{"$f":"-H7+K7","v":0},{"$f":"-I7+K7","v":0},{"$f":"-J7+K7","v":0},0,{"$f":"-L7+K7","v":0},{"$f":"-M7+K7","v":0},{"$f":"-N7+K7","v":0},{"$f":"-O7+K7","v":0},{"$f":"-P7+K7","v":0},null,"S5",0,0,0,0,0,0,0,0,0,0]
[null,0,null,{"$f":"L4","v":""},{"$f":"-G7+L7","v":0},{"$f":"-H7+L7","v":0},{"$f":"-I7+L7","v":0},{"$f":"-J7+L7","v":0},{"$f":"-K7+L7","v":0},0,{"$f":"-M7+L7","v":0},{"$f":"-N7+L7","v":0},{"$f":"-O7+L7","v":0},{"$f":"-P7+L7","v":0},null,"S6",0,0,0,0,0,0,0,0,0,0]
[null,0,null,{"$f":"M4","v":""},{"$f":"-G7+M7","v":0},{"$f":"-H7+M7","v":0},{"$f":"-I7+M7","v":0},{"$f":"-J7+M7","v":0},{"$f":"-K7+M7","v":0},{"$f":"-L7+M7","v":0},0,{"$f":"-N7+M7","v":0},{"$f":"-O7+M7","v":0},{"$f":"-P7+M7","v":0},null,"S7",0,0,0,0,0,0,0,0,0,0]
[null,0,null,{"$f":"N4","v":""},{"$f":"-G7+N7","v":0},{"$f":"-H7+N7","v":0},{"$f":"-I7+N7","v":0},{"$f":"-J7+N7","v":0},{"$f":"-K7+N7","v":0},{"$f":"-L7+N7","v":0},{"$f":"-M7+N7","v":0},0,{"$f":"-O7+N7","v":0},{"$f":"-P7+N7","v":0},null,"S8",0,0,0,0,0,0,0,0,0,0]
[null,0,null,{"$f":"O4","v":""},{"$f":"-G7+O7","v":0},{"$f":"-H7+O7","v":0},{"$f":"-I7+O7","v":0},{"$f":"-J7+O7","v":0},{"$f":"-K7+O7","v":0},{"$f":"-L7+O7","v":0},{"$f":"-M7+O7","v":0},{"$f":"-N7+O7","v":0},0,{"$f":"-P7+O7","v":0},null,"S9",0,0,0,0,0,0,0,0,0,0]
[null,0,null,{"$f":"P4","v":""},{"$f":"-G7+P7","v":0},{"$f":"-H7+P7","v":0},{"$f":"-I7+P7","v":0},{"$f":"-J7+P7","v":0},{"$f":"-K7+P7","v":0},{"$f":"-L7+P7","v":0},{"$f":"-M7+P7","v":0},{"$f":"-N7+P7","v":0},{"$f":"-O7+P7","v":0},0,null,"S10",0,0,0,0,0,0,0,0,0,0]
[]
[]
[null,null,null,1,"ComSaraison Sar Saire dk(ai,bj)"]
[null,null,null,null,{"$f":"G4","v":""},"","","","","","","","",""]
[null,null,{"$f":"IF(E5=\"Min\",(MIN(E48:N57)-MAX(E48:N57))/2,(MAX(E48:N57)-MIN(E48:N57))/2)","v":0},{"$f":"G4","v":""},"x",{"$f":"IF(AND(F$47=\"\",$D48=\"\"),\"x\",IF($E$5=\"Min\",IF(F12<=0,F12,\"min\"), IF(F12>=0,F12,\"max\")))","v":"x"},{"$f":"IF(AND(G$47=\"\",$D48=\"\"),\"x\",IF($E$5=\"Min\",IF(G12<=0,G12,\"min\"), IF(G12>=0,G12,\"max\")))","v":"x"},"x","x","x","x","x","x","x"]
[null,null,null,{"$f":"H4","v":""},{"$f":"IF(AND(E$47=\"\",$D49=\"\"),\"x\",IF($E$5=\"Min\",IF(E13<=0,E13,\"min\"), IF(E13>=0,E13,\"max\")))","v":"x"},"x",{"$f":"IF(AND(G$47=\"\",$D49=\"\"),\"x\",IF($E$5=\"Min\",IF(G13<=0,G13,\"min\"), IF(G13>=0,G13,\"max\")))","v":"x"},"x","x","x","x","x","x","x"]
[null,null,null,{"$f":"I4","v":""},{"$f":"IF(AND(E$47=\"\",$D50=\"\"),\"x\",IF($E$5=\"Min\",IF(E14<=0,E14,\"min\"), IF(E14>=0,E14,\"max\")))","v":"x"},"x","x",{"$f":"IF(AND(H$47=\"\",$D50=\"\"),\"x\",IF($E$5=\"Min\",IF(H14<=0,H14,\"min\"), IF(H14>=0,H14,\"max\")))","v":"x"},"x","x","x","x","x","x"]
[null,null,null,{"$f":"J4","v":""},{"$f":"IF(AND(E$47=\"\",$D51=\"\"),\"x\",IF($E$5=\"Min\",IF(E15<=0,E15,\"min\"), IF(E15>=0,E15,\"max\")))","v":"x"},"x",{"$f":"IF(AND(G$47=\"\",$D51=\"\"),\"x\",IF($E$5=\"Min\",IF(G15<=0,G15,\"min\"), IF(G15>=0,G15,\"max\")))","v":"x"},"x","x","x","x","x","x","x"]
[null,null,null,{"$f":"K4","v":""},{"$f":"IF(AND(E$47=\"\",$D52=\"\"),\"x\",IF($E$5=\"Min\",IF(E16<=0,E16,\"min\"), IF(E16>=0,E16,\"max\")))","v":"x"},"x",{"$f":"IF(AND(G$47=\"\",$D52=\"\"),\"x\",IF($E$5=\"Min\",IF(G16<=0,G16,\"min\"), IF(G16>=0,G16,\"max\")))","v":"x"},"x","x","x","x","x","x","x"]
[null,null,null,{"$f":"L4","v":""},{"$f":"IF(AND(E$47=\"\",$D53=\"\"),\"x\",IF($E$5=\"Min\",IF(E17<=0,E17,\"min\"), IF(E17>=0,E17,\"max\")))","v":"x"},"x",{"$f":"IF(AND(G$47=\"\",$D53=\"\"),\"x\",IF($E$5=\"Min\",IF(G17<=0,G17,\"min\"), IF(G17>=0,G17,\"max\")))","v":"x"},"x","x","x","x","x","x","x"]
[null,null,null,{"$f":"M4","v":""},{"$f":"IF(AND(E$47=\"\",$D54=\"\"),\"x\",IF($E$5=\"Min\",IF(E18<=0,E18,\"min\"), IF(E18>=0,E18,\"max\")))","v":"x"},"x",{"$f":"IF(AND(G$47=\"\",$D54=\"\"),\"x\",IF($E$5=\"Min\",IF(G18<=0,G18,\"min\"), IF(G18>=0,G18,\"max\")))","v":"x"},"x","x","x","x","x","x","x"]
[null,null,null,{"$f":"N4","v":""},{"$f":"IF(AND(E$47=\"\",$D55=\"\"),\"x\",IF($E$5=\"Min\",IF(E19<=0,E19,\"min\"), IF(E19>=0,E19,\"max\")))","v":"x"},"x",{"$f":"IF(AND(G$47=\"\",$D55=\"\"),\"x\",IF($E$5=\"Min\",IF(G19<=0,G19,\"min\"), IF(G19>=0,G19,\"max\")))","v":"x"},"x","x","x","x","x","x","x"]
[null,null,null,{"$f":"O4","v":""},{"$f":"IF(AND(E$47=\"\",$D56=\"\"),\"x\",IF($E$5=\"Min\",IF(E20<=0,E20,\"min\"), IF(E20>=0,E20,\"max\")))","v":"x"},"x",{"$f":"IF(AND(G$47=\"\",$D56=\"\"),\"x\",IF($E$5=\"Min\",IF(G20<=0,G20,\"min\"), IF(G20>=0,G20,\"max\")))","v":"x"},"x","x","x","x","x","x","x"]
[null,null,null,{"$f":"P4","v":""},{"$f":"IF(AND(E$47=\"\",$D57=\"\"),\"x\",IF($E$5=\"Min\",IF(E21<=0,E21,\"min\"), IF(E21>=0,E21,\"max\")))","v":"x"},"x",{"$f":"IF(AND(G$47=\"\",$D57=\"\"),\"x\",IF($E$5=\"Min\",IF(G21<=0,G21,\"min\"), IF(G21>=0,G21,\"max\")))","v":"x"},"x","x","x","x","x","x","x"]
[]
[null,null,{"$f":"IF(E6=\"Min\",(MIN(E59:N68)-MAX(E59:N68))/2,(MAX(E59:N68)-MIN(E59:N68))/2)","v":0},{"$f":"G4","v":""},"x",{"$f":"IF(AND(F$47=\"\",$D59=\"\"),\"x\",IF($E$6=\"Min\",IF(F23<=0,F23,\"min\"), IF(F23>=0,F23,\"max\")))","v":"x"},{"$f":"IF(AND(G$47=\"\",$D59=\"\"),\"x\",IF($E$6=\"Min\",IF(G23<=0,G23,\"min\"), IF(G23>=0,G23,\"max\")))","v":"x"},"x","x","x","x","x","x","x"]
[null,null,null,{"$f":"H4","v":""},{"$f":"IF(AND(E$47=\"\",$D60=\"\"),\"x\",IF($E$6=\"Min\",IF(E24<=0,E24,\"min\"), IF(E24>=0,E24,\"max\")))","v":"x"},"x",{"$f":"IF(AND(G$47=\"\",$D60=\"\"),\"x\",IF($E$6=\"Min\",IF(G24<=0,G24,\"min\"), IF(G24>=0,G24,\"max\")))","v":"x"},"x","x","x","x","x","x","x"]
[null,null,null,{"$f":"I4","v":""},{"$f":"IF(AND(E$47=\"\",$D61=\"\"),\"x\",IF($E$6=\"Min\",IF(E25<=0,E25,\"min\"), IF(E25>=0,E25,\"max\")))","v":"x"},"x","x","x","x","x","x","x","x","x"]
[null,null,null,{"$f":"J4","v":""},{"$f":"IF(AND(E$47=\"\",$D62=\"\"),\"x\",IF($E$6=\"Min\",IF(E26<=0,E26,\"min\"), IF(E26>=0,E26,\"max\")))","v":"x"},"x","x","x","x","x","x","x","x","x"]
[null,null,null,{"$f":"K4","v":""},{"$f":"IF(AND(E$47=\"\",$D63=\"\"),\"x\",IF($E$6=\"Min\",IF(E27<=0,E27,\"min\"), IF(E27>=0,E27,\"max\")))","v":"x"},"x","x","x","x","x","x","x","x","x"]
[null,null,null,{"$f":"L4","v":""},{"$f":"IF(AND(E$47=\"\",$D64=\"\"),\"x\",IF($E$6=\"Min\",IF(E28<=0,E28,\"min\"), IF(E28>=0,E28,\"max\")))","v":"x"},"x","x","x","x","x","x","x","x","x"]
[null,null,null,{"$f":"M4","v":""},{"$f":"IF(AND(E$47=\"\",$D65=\"\"),\"x\",IF($E$6=\"Min\",IF(E29<=0,E29,\"min\"), IF(E29>=0,E29,\"max\")))","v":"x"},"x","x","x","x","x","x","x","x","x"]
[null,null,null,{"$f":"N4","v":""},{"$f":"IF(AND(E$47=\"\",$D66=\"\"),\"x\",IF($E$6=\"Min\",IF(E30<=0,E30,\"min\"), IF(E30>=0,E30,\"max\")))","v":"x"},"x","x","x","x","x","x","x","x","x"]
[null,null,null,{"$f":"O4","v":""},{"$f":"IF(AND(E$47=\"\",$D67=\"\"),\"x\",IF($E$6=\"Min\",IF(E31<=0,E31,\"min\"), IF(E31>=0,E31,\"max\")))","v":"x"},"x","x","x","x","x","x","x","x","x"]
[null,null,null,{"$f":"P4","v":""},{"$f":"IF(AND(E$47=\"\",$D68=\"\"),\"x\",IF($E$6=\"Min\",IF(E32<=0,E32,\"min\"), IF(E32>=0,E32,\"max\")))","v":"x"},"x","x","x","x","x","x","x","x","x"]
[]
[null,null,{"$f":"IF(E7=\"Min\",MIN(E70:N79)-MAX(E70:N79),MAX(E70:N79)-MIN(E70:N79))","v":0},{"$f":"G4","v":""},"x",{"$f":"IF(AND(F$47=\"\",$D70=\"\"),\"x\",IF($E$7=\"Min\",IF(F34<=0,F34,\"X\"), IF(F34>=0,F34,\"max\")))","v":"x"},{"$f":"IF(AND(G$47=\"\",$D70=\"\"),\"x\",IF($E$7=\"Min\",IF(G34<=0,G34,\"X\"), IF(G34>=0,G34,\"max\")))","v":"x"},"x","x","x","x","x","x","x"]
[null,null,null,{"$f":"H4","v":""},{"$f":"IF(AND(E$47=\"\",$D71=\"\"),\"x\",IF($E$7=\"Min\",IF(E35<=0,E35,\"X\"), IF(E35>=0,E35,\"max\")))","v":"x"},"x",{"$f":"IF(AND(G$47=\"\",$D71=\"\"),\"x\",IF($E$7=\"Min\",IF(G35<=0,G35,\"X\"), IF(G35>=0,G35,\"max\")))","v":"x"},"x","x","x","x","x","x","x"]
[null,null,null,{"$f":"I4","v":""},{"$f":"IF(AND(E$47=\"\",$D72=\"\"),\"x\",IF($E$7=\"Min\",IF(E36<=0,E36,\"X\"), IF(E36>=0,E36,\"max\")))","v":"x"},{"$f":"IF(AND(F$47=\"\",$D72=\"\"),\"x\",IF($E$7=\"Min\",IF(F36<=0,F36,\"X\"), IF(F36>=0,F36,\"max\")))","v":"x"},"x","x","x","x","x","x","x","x"]
[null,null,null,{"$f":"J4","v":""},{"$f":"IF(AND(E$47=\"\",$D73=\"\"),\"x\",IF($E$7=\"Min\",IF(E37<=0,E37,\"X\"), IF(E37>=0,E37,\"max\")))","v":"x"},{"$f":"IF(AND(F$47=\"\",$D73=\"\"),\"x\",IF($E$7=\"Min\",IF(F37<=0,F37,\"X\"), IF(F37>=0,F37,\"max\")))","v":"x"},"x","x","x","x","x","x","x","x"]
[null,null,null,{"$f":"K4","v":""},{"$f":"IF(AND(E$47=\"\",$D74=\"\"),\"x\",IF($E$7=\"Min\",IF(E38<=0,E38,\"X\"), IF(E38>=0,E38,\"max\")))","v":"x"},{"$f":"IF(AND(F$47=\"\",$D74=\"\"),\"x\",IF($E$7=\"Min\",IF(F38<=0,F38,\"X\"), IF(F38>=0,F38,\"max\")))","v":"x"},"x","x","x","x","x","x","x","x"]
[null,null,null,{"$f":"L4","v":""},{"$f":"IF(AND(E$47=\"\",$D75=\"\"),\"x\",IF($E$7=\"Min\",IF(E39<=0,E39,\"X\"), IF(E39>=0,E39,\"max\")))","v":"x"},{"$f":"IF(AND(F$47=\"\",$D75=\"\"),\"x\",IF($E$7=\"Min\",IF(F39<=0,F39,\"X\"), IF(F39>=0,F39,\"max\")))","v":"x"},"x","x","x","x","x","x","x","x"]
[null,null,null,{"$f":"M4","v":""},{"$f":"IF(AND(E$47=\"\",$D76=\"\"),\"x\",IF($E$7=\"Min\",IF(E40<=0,E40,\"X\"), IF(E40>=0,E40,\"max\")))","v":"x"},{"$f":"IF(AND(F$47=\"\",$D76=\"\"),\"x\",IF($E$7=\"Min\",IF(F40<=0,F40,\"X\"), IF(F40>=0,F40,\"max\")))","v":"x"},"x","x","x","x","x","x","x","x"]
[null,null,null,{"$f":"N4","v":""},{"$f":"IF(AND(E$47=\"\",$D77=\"\"),\"x\",IF($E$7=\"Min\",IF(E41<=0,E41,\"X\"), IF(E41>=0,E41,\"max\")))","v":"x"},{"$f":"IF(AND(F$47=\"\",$D77=\"\"),\"x\",IF($E$7=\"Min\",IF(F41<=0,F41,\"X\"), IF(F41>=0,F41,\"max\")))","v":"x"},"x","x","x","x","x","x","x","x"]
[null,null,null,{"$f":"O4","v":""},{"$f":"IF(AND(E$47=\"\",$D78=\"\"),\"x\",IF($E$7=\"Min\",IF(E42<=0,E42,\"X\"), IF(E42>=0,E42,\"max\")))","v":"x"},{"$f":"IF(AND(F$47=\"\",$D78=\"\"),\"x\",IF($E$7=\"Min\",IF(F42<=0,F42,\"X\"), IF(F42>=0,F42,\"max\")))","v":"x"},"x","x","x","x","x","x","x","x"]
[null,null,null,{"$f":"P4","v":""},{"$f":"IF(AND(E$47=\"\",$D79=\"\"),\"x\",IF($E$7=\"Min\",IF(E43<=0,E43,\"X\"), IF(E43>=0,E43,\"max\")))","v":"x"},{"$f":"IF(AND(F$47=\"\",$D79=\"\"),\"x\",IF($E$7=\"Min\",IF(F43<=0,F43,\"X\"), IF(F43>=0,F43,\"max\")))","v":"x"},"x","x","x","x","x","x","x","x"]

{"sheet":"Aggre - Envi","index":16,"n_rows":56,"n_cols":43,"rows_kept":56,"cut":false,"hidden":true,"merged":[[46,2,55,2],[33,4,33,13],[35,2,44,2],[1,2,1,38],[7,4,7,13],[7,16,7,25],[7,28,7,37],[9,2,18,2],[20,2,29,2]]}
[]
[null,null,"AGGREGATION - ENVIRONNEMENT"]
[null,null,null,null,null,null,{"$f":"IF(G4=\"\",0,1)","v":0},{"$f":"IF(H4=\"\",0,1)","v":0},0,0,0,0,0,0,0,0,{"$f":"SUM(G3:P3)","v":0}]
[null,null,null,null,null,null,{"$f":"IF(DonnéesFinales!H$19=\"n/a\",\"\",\"T1\")","v":""},{"$f":"IF(DonnéesFinales!I$19=\"n/a\",\"\",\"T2\")","v":""},{"$f":"IF(DonnéesFinales!J$19=\"n/a\",\"\",\"T3\")","v":""},{"$f":"IF(DonnéesFinales!K$19=\"n/a\",\"\",\"T4\")","v":""},{"$f":"IF(DonnéesFinales!L$19=\"n/a\",\"\",\"T5\")","v":""},{"$f":"IF(DonnéesFinales!M$19=\"n/a\",\"\",\"T6\")","v":""},{"$f":"IF(DonnéesFinales!N$19=\"n/a\",\"\",\"T7\")","v":""},{"$f":"IF(DonnéesFinales!O$19=\"n/a\",\"\",\"T8\")","v":""},{"$f":"IF(DonnéesFinales!P$19=\"n/a\",\"\",\"T9\")","v":""},{"$f":"IF(DonnéesFinales!Q$19=\"n/a\",\"\",\"T10\")","v":""}]
[null,null,{"$f":"'Envi-Glob'!C2:AM2","v":"Environnement Globale"},{"$f":"19%+19%+7.75%+15.5%","v":0.61250000000000004},"Max",{"$f":"DonnéesFinales!G32","v":"Unité"},{"$f":"'Envi-Glob'!AQ14","v":0},{"$f":"'Envi-Glob'!AQ15","v":0},{"$f":"'Envi-Glob'!AQ16","v":0},{"$f":"'Envi-Glob'!AQ17","v":0},{"$f":"'Envi-Glob'!AQ18","v":0},{"$f":"'Envi-Glob'!AQ19","v":0},{"$f":"'Envi-Glob'!AQ20","v":0},{"$f":"'Envi-Glob'!AQ21","v":0},{"$f":"'Envi-Glob'!AQ22","v":0},{"$f":"'Envi-Glob'!AQ23","v":0}]
[null,null,{"$f":"'Envi-Loc'!B2:AL2","v":"ENVIRONNEMENT - LOCAL"},{"$f":"15.5%+15.5%+7.75%","v":0.38750000000000001},"Max",{"$f":"DonnéesFinales!G33","v":"Unité"},{"$f":"'Envi-Loc'!AQ12","v":0},{"$f":"'Envi-Loc'!AQ13","v":0},{"$f":"'Envi-Loc'!AQ14","v":0},{"$f":"'Envi-Loc'!AQ15","v":0},{"$f":"'Envi-Loc'!AQ16","v":0},{"$f":"'Envi-Loc'!AQ17","v":0},{"$f":"'Envi-Loc'!AQ18","v":0},{"$f":"'Envi-Loc'!AQ19","v":0},{"$f":"'Envi-Loc'!AQ20","v":0},{"$f":"'Envi-Loc'!AQ21","v":0}]
[]
[null,null,null,1,"Comparaison par paire dk(ai,bj)",null,null,null,null,null,null,null,null,null,null,2,"Fonction de préférence F(dk(ai,bj))",null,null,null,null,null,null,null,null,null,null,3,"Degrée de préférence π(a,b)",null,null,null,null,null,null,null,null,null,null,4,"Flots de surclassement ф(ai,x)"]
[null,null,null,null,{"$f":"G4","v":""},"","","","","","","","","",null,null,"S1","S2","S3","S4","S5","S6","S7","S8","S9","S10",null,null,{"$f":"AB10","v":""},{"$f":"AB11","v":""},{"$f":"AB12","v":""},{"$f":"AB13","v":""},{"$f":"AB14","v":""},{"$f":"AB15","v":""},{"$f":"AB16","v":""},{"$f":"AB17","v":""},{"$f":"AB18","v":""},{"$f":"AB19","v":""},null,null,"ф+(x,a)","ф-(a,x)","ф(a,x)"]
[null,{"$f":"$C$36","v":0},{"$f":"C5","v":"Environnement Globale"},"S1",0,{"$f":"-H5+G5","v":0},{"$f":"-I5+G5","v":0},{"$f":"-J5+G5","v":0},{"$f":"-K5+G5","v":0},{"$f":"-L5+G5","v":0},{"$f":"-M5+G5","v":0},{"$f":"-N5+G5","v":0},{"$f":"-O5+G5","v":0},{"$f":"-P5+G5","v":0},null,"S1",{"$f":"IF(E10<=0,0,1-EXP((-(E10^2))/(2*$B10^2)))","v":0},{"$f":"IF(F10<=0,0,1-EXP((-(F10^2))/(2*$B10^2)))","v":0},0,0,0,0,0,0,0,0,null,{"$f":"IF(DonnéesFinales!H$19=\"n/a\",\"\",\"T1\")","v":""},{"$f":"IF(OR($AB10=\"\",AC$9=\"\"),0,Q10*$D$5+Q21*$D$6)","v":0},{"$f":"IF(OR($AB10=\"\",AD$9=\"\"),0,R10*$D$5+R21*$D$6)","v":0},{"$f":"IF(OR($AB10=\"\",AE$9=\"\"),0,S10*$D$5+S21*$D$6)","v":0},{"$f":"IF(OR($AB10=\"\",AF$9=\"\"),0,T10*$D$5+T21*$D$6)","v":0},{"$f":"IF(OR($AB10=\"\",AG$9=\"\"),0,U10*$D$5+U21*$D$6)","v":0},{"$f":"IF(OR($AB10=\"\",AH$9=\"\"),0,V10*$D$5+V21*$D$6)","v":0},{"$f":"IF(OR($AB10=\"\",AI$9=\"\"),0,W10*$D$5+W21*$D$6)","v":0},{"$f":"IF(OR($AB10=\"\",AJ$9=\"\"),0,X10*$D$5+X21*$D$6)","v":0},{"$f":"IF(OR($AB10=\"\",AK$9=\"\"),0,Y10*$D$5+Y21*$D$6)","v":0},{"$f":"IF(OR($AB10=\"\",AL$9=\"\"),0,Z10*$D$5+Z21*$D$6)","v":0},null,{"$f":"AB10","v":""},{"$f":"(1/($Q$3-1))*SUM(AC10:AL10)","v":0},{"$f":"(1/($Q$3-1))*SUM(AC10:AC19)","v":0},{"$f":"AO10-AP10","v":0}]
[null,0,null,"S2",{"$f":"-G5+H5","v":0},0,{"$f":"-I5+H5","v":0},{"$f":"-J5+H5","v":0},{"$f":"-K5+H5","v":0},{"$f":"-L5+H5","v":0},{"$f":"-M5+H5","v":0},{"$f":"-N5+H5","v":0},{"$f":"-O5+H5","v":0},{"$f":"-P5+H5","v":0},null,"S2",{"$f":"IF(E11<=0,0,1-EXP((-(E11^2))/(2*$B11^2)))","v":0},{"$f":"IF(F11<=0,0,1-EXP((-(F11^2))/(2*$B11^2)))","v":0},{"$f":"IF(G11<=0,0,1-EXP((-(G11^2))/(2*$B11^2)))","v":0},{"$f":"IF(H11<=0,0,1-EXP((-(H11^2))/(2*$B11^2)))","v":0},{"$f":"IF(I11<=0,0,1-EXP((-(I11^2))/(2*$B11^2)))","v":0},{"$f":"IF(J11<=0,0,1-EXP((-(J11^2))/(2*$B11^2)))","v":0},{"$f":"IF(K11<=0,0,1-EXP((-(K11^2))/(2*$B11^2)))","v":0},{"$f":"IF(L11<=0,0,1-EXP((-(L11^2))/(2*$B11^2)))","v":0},{"$f":"IF(M11<=0,0,1-EXP((-(M11^2))/(2*$B11^2)))","v":0},{"$f":"IF(N11<=0,0,1-EXP((-(N11^2))/(2*$B11^2)))","v":0},null,{"$f":"IF(DonnéesFinales!I$19=\"n/a\",\"\",\"T2\")","v":""},{"$f":"IF(OR($AB11=\"\",AC$9=\"\"),0,Q11*$D$5+Q22*$D$6)","v":0},0,0,0,0,0,0,0,0,0,null,"",{"$f":"(1/($Q$3-1))*SUM(AC11:AL11)","v":0},{"$f":"(1/($Q$3-1))*SUM(AD10:AD19)","v":0},{"$f":"AO11-AP11","v":0}]
[null,0,null,"S3",{"$f":"-G5+I5","v":0},{"$f":"-H5+I5","v":0},0,{"$f":"-J5+I5","v":0},{"$f":"-K5+I5","v":0},{"$f":"-L5+I5","v":0},{"$f":"-M5+I5","v":0},{"$f":"-N5+I5","v":0},{"$f":"-O5+I5","v":0},{"$f":"-P5+I5","v":0},null,"S3",0,0,0,0,0,0,0,0,0,0,null,{"$f":"IF(DonnéesFinales!J$19=\"n/a\",\"\",\"T3\")","v":""},0,0,0,0,0,0,0,0,0,0,null,"",0,{"$f":"(1/($Q$3-1))*SUM(AE10:AE19)","v":0},0]
[null,0,null,"S4",{"$f":"-G5+J5","v":0},{"$f":"-H5+J5","v":0},{"$f":"-I5+J5","v":0},0,{"$f":"-K5+J5","v":0},{"$f":"-L5+J5","v":0},{"$f":"-M5+J5","v":0},{"$f":"-N5+J5","v":0},{"$f":"-O5+J5","v":0},{"$f":"-P5+J5","v":0},null,"S4",0,0,0,0,0,0,0,0,0,0,null,{"$f":"IF(DonnéesFinales!K$19=\"n/a\",\"\",\"T4\")","v":""},0,0,0,{"$f":"IF(OR($AB13=\"\",AF$9=\"\"),0,T13*$D$5+T24*$D$6)","v":0},0,0,0,0,0,0,null,"",{"$f":"(1/($Q$3-1))*SUM(AC13:AL13)","v":0},{"$f":"(1/($Q$3-1))*SUM(AF10:AF19)","v":0},0]
[null,0,null,"S5",{"$f":"-G5+K5","v":0},{"$f":"-H5+K5","v":0},{"$f":"-I5+K5","v":0},{"$f":"-J5+K5","v":0},0,{"$f":"-L5+K5","v":0},{"$f":"-M5+K5","v":0},{"$f":"-N5+K5","v":0},{"$f":"-O5+K5","v":0},{"$f":"-P5+K5","v":0},null,"S5",0,0,0,0,0,0,0,0,0,0,null,{"$f":"IF(DonnéesFinales!L$19=\"n/a\",\"\",\"T5\")","v":""},0,0,0,0,0,0,0,0,0,0,null,"",0,{"$f":"(1/($Q$3-1))*SUM(AG10:AG19)","v":0},0]
[null,0,null,"S6",{"$f":"-G5+L5","v":0},{"$f":"-H5+L5","v":0},{"$f":"-I5+L5","v":0},{"$f":"-J5+L5","v":0},{"$f":"-K5+L5","v":0},0,{"$f":"-M5+L5","v":0},{"$f":"-N5+L5","v":0},{"$f":"-O5+L5","v":0},{"$f":"-P5+L5","v":0},null,"S6",0,0,0,0,0,0,0,0,0,0,null,{"$f":"IF(DonnéesFinales!M$19=\"n/a\",\"\",\"T6\")","v":""},0,0,0,0,0,0,0,0,0,0,null,"",0,{"$f":"(1/($Q$3-1))*SUM(AH10:AH19)","v":0},0]
[null,0,null,"S7",{"$f":"-G5+M5","v":0},{"$f":"-H5+M5","v":0},{"$f":"-I5+M5","v":0},{"$f":"-J5+M5","v":0},{"$f":"-K5+M5","v":0},{"$f":"-L5+M5","v":0},0,{"$f":"-N5+M5","v":0},{"$f":"-O5+M5","v":0},{"$f":"-P5+M5","v":0},null,"S7",0,0,0,0,0,0,0,0,0,0,null,{"$f":"IF(DonnéesFinales!N$19=\"n/a\",\"\",\"T7\")","v":""},0,0,0,0,0,0,0,0,0,0,null,"",0,{"$f":"(1/($Q$3-1))*SUM(AI10:AI19)","v":0},0]
[null,0,null,"S8",{"$f":"-G5+N5","v":0},{"$f":"-H5+N5","v":0},{"$f":"-I5+N5","v":0},{"$f":"-J5+N5","v":0},{"$f":"-K5+N5","v":0},{"$f":"-L5+N5","v":0},{"$f":"-M5+N5","v":0},0,{"$f":"-O5+N5","v":0},{"$f":"-P5+N5","v":0},null,"S8",0,0,0,0,0,0,0,0,0,0,null,{"$f":"IF(DonnéesFinales!O$19=\"n/a\",\"\",\"T8\")","v":""},0,0,0,0,0,0,0,0,0,0,null,"",0,{"$f":"(1/($Q$3-1))*SUM(AJ10:AJ19)","v":0},0]
[null,0,null,"S9",{"$f":"-G5+O5","v":0},{"$f":"-H5+O5","v":0},{"$f":"-I5+O5","v":0},{"$f":"-J5+O5","v":0},{"$f":"-K5+O5","v":0},{"$f":"-L5+O5","v":0},{"$f":"-M5+O5","v":0},{"$f":"-N5+O5","v":0},0,{"$f":"-P5+O5","v":0},null,"S9",0,0,0,0,0,0,0,0,0,0,null,{"$f":"IF(DonnéesFinales!P$19=\"n/a\",\"\",\"T9\")","v":""},0,0,0,0,0,0,0,0,0,0,null,"",0,{"$f":"(1/($Q$3-1))*SUM(AK10:AK19)","v":0},0]
[null,0,null,"S10",{"$f":"-G5+P5","v":0},{"$f":"-H5+P5","v":0},{"$f":"-I5+P5","v":0},{"$f":"-J5+P5","v":0},{"$f":"-K5+P5","v":0},{"$f":"-L5+P5","v":0},{"$f":"-M5+P5","v":0},{"$f":"-N5+P5","v":0},{"$f":"-O5+P5","v":0},0,null,"S10",0,0,0,0,0,0,0,0,0,0,null,{"$f":"IF(DonnéesFinales!Q$19=\"n/a\",\"\",\"T10\")","v":""},0,0,0,0,0,0,0,0,0,0,null,"",0,{"$f":"(1/($Q$3-1))*SUM(AL10:AL19)","v":0},0]
[]
[null,{"$f":"$C$47","v":0},{"$f":"C6","v":"ENVIRONNEMENT - LOCAL"},"S1",0,{"$f":"-H6+G6","v":0},{"$f":"-I6+G6","v":0},{"$f":"-J6+G6","v":0},{"$f":"-K6+G6","v":0},{"$f":"-L6+G6","v":0},{"$f":"-M6+G6","v":0},{"$f":"-N6+G6","v":0},{"$f":"-O6+G6","v":0},{"$f":"-P6+G6","v":0},null,"S1",{"$f":"IF(E21<=0,0,1-EXP((-(E21^2))/(2*$B21^2)))","v":0},{"$f":"IF(F21<=0,0,1-EXP((-(F21^2))/(2*$B21^2)))","v":0},0,0,0,0,0,0,0,0]
[null,0,null,"S2",{"$f":"-G6+H6","v":0},0,{"$f":"-I6+H6","v":0},{"$f":"-J6+H6","v":0},{"$f":"-K6+H6","v":0},{"$f":"-L6+H6","v":0},{"$f":"-M6+H6","v":0},{"$f":"-N6+H6","v":0},{"$f":"-O6+H6","v":0},{"$f":"-P6+H6","v":0},null,"S2",{"$f":"IF(E22<=0,0,1-EXP((-(E22^2))/(2*$B22^2)))","v":0},{"$f":"IF(F22<=0,0,1-EXP((-(F22^2))/(2*$B22^2)))","v":0},{"$f":"IF(G22<=0,0,1-EXP((-(G22^2))/(2*$B22^2)))","v":0},{"$f":"IF(H22<=0,0,1-EXP((-(H22^2))/(2*$B22^2)))","v":0},{"$f":"IF(I22<=0,0,1-EXP((-(I22^2))/(2*$B22^2)))","v":0},{"$f":"IF(J22<=0,0,1-EXP((-(J22^2))/(2*$B22^2)))","v":0},{"$f":"IF(K22<=0,0,1-EXP((-(K22^2))/(2*$B22^2)))","v":0},{"$f":"IF(L22<=0,0,1-EXP((-(L22^2))/(2*$B22^2)))","v":0},{"$f":"IF(M22<=0,0,1-EXP((-(M22^2))/(2*$B22^2)))","v":0},{"$f":"IF(N22<=0,0,1-EXP((-(N22^2))/(2*$B22^2)))","v":0}]
[null,0,null,"S3",{"$f":"-G6+I6","v":0},{"$f":"-H6+I6","v":0},0,{"$f":"-J6+I6","v":0},{"$f":"-K6+I6","v":0},{"$f":"-L6+I6","v":0},{"$f":"-M6+I6","v":0},{"$f":"-N6+I6","v":0},{"$f":"-O6+I6","v":0},{"$f":"-P6+I6","v":0},null,"S3",0,0,0,0,0,0,0,0,0,0]
[null,0,null,"S4",{"$f":"-G6+J6","v":0},{"$f":"-H6+J6","v":0},{"$f":"-I6+J6","v":0},0,{"$f":"-K6+J6","v":0},{"$f":"-L6+J6","v":0},{"$f":"-M6+J6","v":0},{"$f":"-N6+J6","v":0},{"$f":"-O6+J6","v":0},{"$f":"-P6+J6","v":0},null,"S4",0,0,0,0,0,0,0,0,0,0]
[null,0,null,"S5",{"$f":"-G6+K6","v":0},{"$f":"-H6+K6","v":0},{"$f":"-I6+K6","v":0},{"$f":"-J6+K6","v":0},0,{"$f":"-L6+K6","v":0},{"$f":"-M6+K6","v":0},{"$f":"-N6+K6","v":0},{"$f":"-O6+K6","v":0},{"$f":"-P6+K6","v":0},null,"S5",0,0,0,0,0,0,0,0,0,0]
[null,0,null,"S6",{"$f":"-G6+L6","v":0},{"$f":"-H6+L6","v":0},{"$f":"-I6+L6","v":0},{"$f":"-J6+L6","v":0},{"$f":"-K6+L6","v":0},0,{"$f":"-M6+L6","v":0},{"$f":"-N6+L6","v":0},{"$f":"-O6+L6","v":0},{"$f":"-P6+L6","v":0},null,"S6",0,0,0,0,0,0,0,0,0,0]
[null,0,null,"S7",{"$f":"-G6+M6","v":0},{"$f":"-H6+M6","v":0},{"$f":"-I6+M6","v":0},{"$f":"-J6+M6","v":0},{"$f":"-K6+M6","v":0},{"$f":"-L6+M6","v":0},0,{"$f":"-N6+M6","v":0},{"$f":"-O6+M6","v":0},{"$f":"-P6+M6","v":0},null,"S7",0,0,0,0,0,0,0,0,0,0]
[null,0,null,"S8",{"$f":"-G6+N6","v":0},{"$f":"-H6+N6","v":0},{"$f":"-I6+N6","v":0},{"$f":"-J6+N6","v":0},{"$f":"-K6+N6","v":0},{"$f":"-L6+N6","v":0},{"$f":"-M6+N6","v":0},0,{"$f":"-O6+N6","v":0},{"$f":"-P6+N6","v":0},null,"S8",0,0,0,0,0,0,0,0,0,0]
[null,0,null,"S9",{"$f":"-G6+O6","v":0},{"$f":"-H6+O6","v":0},{"$f":"-I6+O6","v":0},{"$f":"-J6+O6","v":0},{"$f":"-K6+O6","v":0},{"$f":"-L6+O6","v":0},{"$f":"-M6+O6","v":0},{"$f":"-N6+O6","v":0},0,{"$f":"-P6+O6","v":0},null,"S9",0,0,0,0,0,0,0,0,0,0]
[null,0,null,"S10",{"$f":"-G6+P6","v":0},{"$f":"-H6+P6","v":0},{"$f":"-I6+P6","v":0},{"$f":"-J6+P6","v":0},{"$f":"-K6+P6","v":0},{"$f":"-L6+P6","v":0},{"$f":"-M6+P6","v":0},{"$f":"-N6+P6","v":0},{"$f":"-O6+P6","v":0},0,null,"S10",0,0,0,0,0,0,0,0,0,0]
[]
[]
[]
[null,null,null,1,"Comparaison par paire dk(ai,bj)"]
[null,null,null,null,{"$f":"G4","v":""},"","","","","","","","",""]
[null,null,{"$f":"IF(E5=\"Min\",(MIN(E36:N45)-MAX(E36:N45))/2,(MAX(E36:N45)-MIN(E36:N45))/2)","v":0},{"$f":"G4","v":""},"x",{"$f":"IF(AND(F$35=\"\",$D36=\"\"),\"x\",IF($E$5=\"Min\",IF(F12<=0,F12,\"X\"), IF(F12>=0,F12,\"X\")))","v":"x"},{"$f":"IF(AND(G$35=\"\",$D36=\"\"),\"x\",IF($E$5=\"Min\",IF(G12<=0,G12,\"X\"), IF(G12>=0,G12,\"X\")))","v":"x"},"x","x","x","x","x","x","x"]
[null,null,null,{"$f":"H4","v":""},{"$f":"IF(AND(E$35=\"\",$D37=\"\"),\"x\",IF($E$5=\"Min\",IF(E13<=0,E13,\"X\"), IF(E13>=0,E13,\"X\")))","v":"x"},"x","x","x","x","x","x","x","x","x"]
[null,null,null,{"$f":"I4","v":""},{"$f":"IF(AND(E$35=\"\",$D38=\"\"),\"x\",IF($E$5=\"Min\",IF(E14<=0,E14,\"X\"), IF(E14>=0,E14,\"X\")))","v":"x"},{"$f":"IF(AND(F$35=\"\",$D38=\"\"),\"x\",IF($E$5=\"Min\",IF(F14<=0,F14,\"X\"), IF(F14>=0,F14,\"X\")))","v":"x"},"x","x","x","x","x","x","x","x"]
[null,null,null,{"$f":"J4","v":""},"x","x","x","x","x","x","x","x","x","x"]
[null,null,null,{"$f":"K4","v":""},"x","x","x","x","x","x","x","x","x","x"]
[null,null,null,{"$f":"L4","v":""},"x","x","x","x","x","x","x","x","x","x"]
[null,null,null,{"$f":"M4","v":""},"x","x","x","x","x","x","x","x","x","x"]
[null,null,null,{"$f":"N4","v":""},"x","x","x","x","x","x","x","x","x","x"]
[null,null,null,{"$f":"O4","v":""},"x","x","x","x","x","x","x","x","x","x"]
[null,null,null,{"$f":"P4","v":""},"x","x","x","x","x","x","x","x","x","x"]
[]
[null,null,{"$f":"IF(E6=\"Min\",(MIN(E47:N56)-MAX(E47:N56))/2,(MAX(E47:N56)-MIN(E47:N56))/2)","v":0},{"$f":"G4","v":""},"x",{"$f":"IF(AND(F$35=\"\",$D47=\"\"),\"x\",IF($E$6=\"Min\",IF(F23<=0,F23,\"min\"), IF(F23>=0,F23,\"max\")))","v":"x"},{"$f":"IF(AND(G$35=\"\",$D47=\"\"),\"x\",IF($E$6=\"Min\",IF(G23<=0,G23,\"min\"), IF(G23>=0,G23,\"max\")))","v":"x"},"x","x","x","x","x","x","x"]
[null,null,null,{"$f":"H4","v":""},{"$f":"IF(AND(E$35=\"\",$D48=\"\"),\"x\",IF($E$6=\"Min\",IF(E24<=0,E24,\"min\"), IF(E24>=0,E24,\"max\")))","v":"x"},"x","x","x","x","x","x","x","x","x"]
[null,null,null,{"$f":"I4","v":""},"x","x","x","x","x","x","x","x","x","x"]
[null,null,null,{"$f":"J4","v":""},{"$f":"IF(AND(E$35=\"\",$D50=\"\"),\"x\",IF($E$6=\"Min\",IF(E26<=0,E26,\"min\"), IF(E26>=0,E26,\"max\")))","v":"x"},"x","x","x","x","x","x","x","x","x"]
[null,null,null,{"$f":"K4","v":""},{"$f":"IF(AND(E$35=\"\",$D51=\"\"),\"x\",IF($E$6=\"Min\",IF(E27<=0,E27,\"min\"), IF(E27>=0,E27,\"max\")))","v":"x"},"x","x","x","x","x","x","x","x","x"]
[null,null,null,{"$f":"L4","v":""},{"$f":"IF(AND(E$35=\"\",$D52=\"\"),\"x\",IF($E$6=\"Min\",IF(E28<=0,E28,\"min\"), IF(E28>=0,E28,\"max\")))","v":"x"},"x","x","x","x","x","x","x","x","x"]
[null,null,null,{"$f":"M4","v":""},{"$f":"IF(AND(E$35=\"\",$D53=\"\"),\"x\",IF($E$6=\"Min\",IF(E29<=0,E29,\"min\"), IF(E29>=0,E29,\"max\")))","v":"x"},"x","x","x","x","x","x","x","x","x"]
[null,null,null,{"$f":"N4","v":""},{"$f":"IF(AND(E$35=\"\",$D54=\"\"),\"x\",IF($E$6=\"Min\",IF(E30<=0,E30,\"min\"), IF(E30>=0,E30,\"max\")))","v":"x"},"x","x","x","x","x","x","x",{"$f":"IF(AND(M$35=\"\",$D54=\"\"),\"x\",IF($E$6=\"Min\",IF(M30<=0,M30,\"X\"), IF(M30>=0,M30,\"bo\")))","v":"x"},"x"]
[null,null,null,{"$f":"O4","v":""},{"$f":"IF(AND(E$35=\"\",$D55=\"\"),\"x\",IF($E$6=\"Min\",IF(E31<=0,E31,\"min\"), IF(E31>=0,E31,\"max\")))","v":"x"},"x","x","x","x","x","x","x","x","x"]
[null,null,null,{"$f":"P4","v":""},{"$f":"IF(AND(E$35=\"\",$D56=\"\"),\"x\",IF($E$6=\"Min\",IF(E32<=0,E32,\"min\"), IF(E32>=0,E32,\"max\")))","v":"x"},"x","x","x","x","x","x","x","x","x"]

{"sheet":"Aggre - Soc","index":17,"n_rows":56,"n_cols":43,"rows_kept":56,"cut":false,"hidden":true,"merged":[[35,2,44,2],[46,2,55,2],[1,2,1,38],[9,16,9,25],[9,28,9,37],[11,2,20,2],[22,2,31,2],[9,4,9,13]]}
[]
[null,null,"AGGREGATION - SOCIAL"]
[null,null,null,null,null,null,{"$f":"IF(G4=\"\",0,1)","v":0},0,0,0,0,0,0,0,0,0,{"$f":"SUM(G3:P3)","v":0}]
[null,null,null,null,null,null,{"$f":"IF(DonnéesFinales!H$19=\"n/a\",\"\",\"T1\")","v":""},{"$f":"IF(DonnéesFinales!I$19=\"n/a\",\"\",\"T2\")","v":""},{"$f":"IF(DonnéesFinales!J$19=\"n/a\",\"\",\"T3\")","v":""},{"$f":"IF(DonnéesFinales!K$19=\"n/a\",\"\",\"T4\")","v":""},{"$f":"IF(DonnéesFinales!L$19=\"n/a\",\"\",\"T5\")","v":""},{"$f":"IF(DonnéesFinales!M$19=\"n/a\",\"\",\"T6\")","v":""},{"$f":"IF(DonnéesFinales!N$19=\"n/a\",\"\",\"T7\")","v":""},{"$f":"IF(DonnéesFinales!O$19=\"n/a\",\"\",\"T8\")","v":""},{"$f":"IF(DonnéesFinales!P$19=\"n/a\",\"\",\"T9\")","v":""},{"$f":"IF(DonnéesFinales!Q$19=\"n/a\",\"\",\"T10\")","v":""}]
[null,null,{"$f":"'Soc-Glob'!C2:AM2","v":"SOCIAL - GLOBAL"},{"$f":"28%+24%","v":0.52},"Max","Unité",{"$f":"'Soc-Glob'!AQ11","v":0},{"$f":"'Soc-Glob'!AQ12","v":0},{"$f":"'Soc-Glob'!AQ13","v":0},{"$f":"'Soc-Glob'!AQ14","v":0},{"$f":"'Soc-Glob'!AQ15","v":0},{"$f":"'Soc-Glob'!AQ16","v":0},{"$f":"'Soc-Glob'!AQ17","v":0},{"$f":"'Soc-Glob'!AQ18","v":0},{"$f":"'Soc-Glob'!AQ19","v":0},{"$f":"'Soc-Glob'!AQ20","v":0}]
[null,null,{"$f":"'Soc-Loc'!C2:AM2","v":"SOCIAL - LOCAL"},{"$f":"24%+24%","v":0.48},"Max","Unité",{"$f":"'Soc-Loc'!AQ11","v":0},{"$f":"'Soc-Loc'!AQ12","v":0},{"$f":"'Soc-Loc'!AQ13","v":0},{"$f":"'Soc-Loc'!AQ14","v":0},{"$f":"'Soc-Loc'!AQ15","v":0},{"$f":"'Soc-Loc'!AQ16","v":0},{"$f":"'Soc-Loc'!AQ17","v":0},{"$f":"'Soc-Loc'!AQ18","v":0},{"$f":"'Soc-Loc'!AQ19","v":0},{"$f":"'Soc-Loc'!AQ20","v":0}]
[]
[]
[]
[null,null,null,1,"Comparaison par paire dk(ai,bj)",null,null,null,null,null,null,null,null,null,null,2,"Fonction de préférence F(dk(ai,bj))",null,null,null,null,null,null,null,null,null,null,3,"Degrée de préférence π(a,b)",null,null,null,null,null,null,null,null,null,null,4,"Flots de surclassement ф(ai,x)"]
[null,null,null,null,{"$f":"G4","v":""},"","","","","","","","","",null,null,"S1","S2","S3","S4","S5","S6","S7","S8","S9","S10",null,null,{"$f":"AB12","v":""},{"$f":"AB13","v":""},{"$f":"AB14","v":""},{"$f":"AB15","v":""},{"$f":"AB16","v":""},{"$f":"AB17","v":""},{"$f":"AB18","v":""},{"$f":"AB19","v":""},{"$f":"AB20","v":""},{"$f":"AB21","v":""},null,null,"ф+(x,a)","ф-(a,x)","ф(a,x)"]
[null,{"$f":"$C$36","v":0},{"$f":"C5","v":"SOCIAL - GLOBAL"},"S1",0,{"$f":"-H5+G5","v":0},{"$f":"-I5+G5","v":0},{"$f":"-J5+G5","v":0},{"$f":"-K5+G5","v":0},{"$f":"-L5+G5","v":0},{"$f":"-M5+G5","v":0},{"$f":"-N5+G5","v":0},{"$f":"-O5+G5","v":0},{"$f":"-P5+G5","v":0},null,"S1",{"$f":"IF(E12<=0,0,1-EXP((-(E12^2))/(2*$B12^2)))","v":0},{"$f":"IF(F12<=0,0,1-EXP((-(F12^2))/(2*$B12^2)))","v":0},0,0,0,0,0,0,0,0,null,{"$f":"IF(DonnéesFinales!H$19=\"n/a\",\"\",\"T1\")","v":""},{"$f":"IF(OR($AB12=\"\",AC$11=\"\"),0,Q12*$D$5+Q23*$D$6)","v":0},{"$f":"IF(OR($AB12=\"\",AD$11=\"\"),0,R12*$D$5+R23*$D$6)","v":0},{"$f":"IF(OR($AB12=\"\",AE$11=\"\"),0,S12*$D$5+S23*$D$6)","v":0},{"$f":"IF(OR($AB12=\"\",AF$11=\"\"),0,T12*$D$5+T23*$D$6)","v":0},{"$f":"IF(OR($AB12=\"\",AG$11=\"\"),0,U12*$D$5+U23*$D$6)","v":0},{"$f":"IF(OR($AB12=\"\",AH$11=\"\"),0,V12*$D$5+V23*$D$6)","v":0},{"$f":"IF(OR($AB12=\"\",AI$11=\"\"),0,W12*$D$5+W23*$D$6)","v":0},{"$f":"IF(OR($AB12=\"\",AJ$11=\"\"),0,X12*$D$5+X23*$D$6)","v":0},{"$f":"IF(OR($AB12=\"\",AK$11=\"\"),0,Y12*$D$5+Y23*$D$6)","v":0},{"$f":"IF(OR($AB12=\"\",AL$11=\"\"),0,Z12*$D$5+Z23*$D$6)","v":0},null,{"$f":"AB12","v":""},{"$f":"(1/($Q$3-1))*SUM(AC12:AL12)","v":0},{"$f":"(1/($Q$3-1))*SUM(AC12:AC21)","v":0},{"$f":"AO12-AP12","v":0}]
[null,0,null,"S2",{"$f":"-G5+H5","v":0},0,{"$f":"-I5+H5","v":0},{"$f":"-J5+H5","v":0},{"$f":"-K5+H5","v":0},{"$f":"-L5+H5","v":0},{"$f":"-M5+H5","v":0},{"$f":"-N5+H5","v":0},{"$f":"-O5+H5","v":0},{"$f":"-P5+H5","v":0},null,"S2",{"$f":"IF(E13<=0,0,1-EXP((-(E13^2))/(2*$B13^2)))","v":0},{"$f":"IF(F13<=0,0,1-EXP((-(F13^2))/(2*$B13^2)))","v":0},{"$f":"IF(G13<=0,0,1-EXP((-(G13^2))/(2*$B13^2)))","v":0},{"$f":"IF(H13<=0,0,1-EXP((-(H13^2))/(2*$B13^2)))","v":0},{"$f":"IF(I13<=0,0,1-EXP((-(I13^2))/(2*$B13^2)))","v":0},{"$f":"IF(J13<=0,0,1-EXP((-(J13^2))/(2*$B13^2)))","v":0},{"$f":"IF(K13<=0,0,1-EXP((-(K13^2))/(2*$B13^2)))","v":0},{"$f":"IF(L13<=0,0,1-EXP((-(L13^2))/(2*$B13^2)))","v":0},{"$f":"IF(M13<=0,0,1-EXP((-(M13^2))/(2*$B13^2)))","v":0},{"$f":"IF(N13<=0,0,1-EXP((-(N13^2))/(2*$B13^2)))","v":0},null,{"$f":"IF(DonnéesFinales!I$19=\"n/a\",\"\",\"T2\")","v":""},0,0,0,0,0,0,0,0,0,0,null,"",0,{"$f":"(1/($Q$3-1))*SUM(AD12:AD21)","v":0},{"$f":"AO13-AP13","v":0}]
[null,0,null,"S3",{"$f":"-G5+I5","v":0},{"$f":"-H5+I5","v":0},0,{"$f":"-J5+I5","v":0},{"$f":"-K5+I5","v":0},{"$f":"-L5+I5","v":0},{"$f":"-M5+I5","v":0},{"$f":"-N5+I5","v":0},{"$f":"-O5+I5","v":0},{"$f":"-P5+I5","v":0},null,"S3",0,0,0,0,0,0,0,0,0,0,null,{"$f":"IF(DonnéesFinales!J$19=\"n/a\",\"\",\"T3\")","v":""},0,0,0,0,0,0,0,0,0,0,null,"",0,{"$f":"(1/($Q$3-1))*SUM(AE12:AE21)","v":0},0]
[null,0,null,"S4",{"$f":"-G5+J5","v":0},{"$f":"-H5+J5","v":0},{"$f":"-I5+J5","v":0},0,{"$f":"-K5+J5","v":0},{"$f":"-L5+J5","v":0},{"$f":"-M5+J5","v":0},{"$f":"-N5+J5","v":0},{"$f":"-O5+J5","v":0},{"$f":"-P5+J5","v":0},null,"S4",0,0,0,0,0,0,0,0,0,0,null,{"$f":"IF(DonnéesFinales!K$19=\"n/a\",\"\",\"T4\")","v":""},0,0,0,0,0,0,0,0,0,0,null,"",0,{"$f":"(1/($Q$3-1))*SUM(AF12:AF21)","v":0},0]
[null,0,null,"S5",{"$f":"-G5+K5","v":0},{"$f":"-H5+K5","v":0},{"$f":"-I5+K5","v":0},{"$f":"-J5+K5","v":0},0,{"$f":"-L5+K5","v":0},{"$f":"-M5+K5","v":0},{"$f":"-N5+K5","v":0},{"$f":"-O5+K5","v":0},{"$f":"-P5+K5","v":0},null,"S5",0,0,0,0,0,0,0,0,0,0,null,{"$f":"IF(DonnéesFinales!L$19=\"n/a\",\"\",\"T5\")","v":""},0,0,0,0,0,0,0,0,0,0,null,"",0,{"$f":"(1/($Q$3-1))*SUM(AG12:AG21)","v":0},0]
[null,0,null,"S6",{"$f":"-G5+L5","v":0},{"$f":"-H5+L5","v":0},{"$f":"-I5+L5","v":0},{"$f":"-J5+L5","v":0},{"$f":"-K5+L5","v":0},0,{"$f":"-M5+L5","v":0},{"$f":"-N5+L5","v":0},{"$f":"-O5+L5","v":0},{"$f":"-P5+L5","v":0},null,"S6",0,0,0,0,0,0,0,0,0,0,null,{"$f":"IF(DonnéesFinales!M$19=\"n/a\",\"\",\"T6\")","v":""},0,0,0,0,0,0,0,0,0,0,null,"",0,{"$f":"(1/($Q$3-1))*SUM(AH12:AH21)","v":0},0]
[null,0,null,"S7",{"$f":"-G5+M5","v":0},{"$f":"-H5+M5","v":0},{"$f":"-I5+M5","v":0},{"$f":"-J5+M5","v":0},{"$f":"-K5+M5","v":0},{"$f":"-L5+M5","v":0},0,{"$f":"-N5+M5","v":0},{"$f":"-O5+M5","v":0},{"$f":"-P5+M5","v":0},null,"S7",0,0,0,0,0,0,0,0,0,0,null,{"$f":"IF(DonnéesFinales!N$19=\"n/a\",\"\",\"T7\")","v":""},0,0,0,0,0,0,0,0,0,0,null,"",0,{"$f":"(1/($Q$3-1))*SUM(AI12:AI21)","v":0},0]
[null,0,null,"S8",{"$f":"-G5+N5","v":0},{"$f":"-H5+N5","v":0},{"$f":"-I5+N5","v":0},{"$f":"-J5+N5","v":0},{"$f":"-K5+N5","v":0},{"$f":"-L5+N5","v":0},{"$f":"-M5+N5","v":0},0,{"$f":"-O5+N5","v":0},{"$f":"-P5+N5","v":0},null,"S8",0,0,0,0,0,0,0,0,0,0,null,{"$f":"IF(DonnéesFinales!O$19=\"n/a\",\"\",\"T8\")","v":""},0,0,0,0,0,0,0,0,0,0,null,"",0,{"$f":"(1/($Q$3-1))*SUM(AJ12:AJ21)","v":0},0]
[null,0,null,"S9",{"$f":"-G5+O5","v":0},{"$f":"-H5+O5","v":0},{"$f":"-I5+O5","v":0},{"$f":"-J5+O5","v":0},{"$f":"-K5+O5","v":0},{"$f":"-L5+O5","v":0},{"$f":"-M5+O5","v":0},{"$f":"-N5+O5","v":0},0,{"$f":"-P5+O5","v":0},null,"S9",0,0,0,0,0,0,0,0,0,0,null,{"$f":"IF(DonnéesFinales!P$19=\"n/a\",\"\",\"T9\")","v":""},0,0,0,0,0,0,0,0,0,0,null,"",0,{"$f":"(1/($Q$3-1))*SUM(AK12:AK21)","v":0},0]
[null,0,null,"S10",{"$f":"-G5+P5","v":0},{"$f":"-H5+P5","v":0},{"$f":"-I5+P5","v":0},{"$f":"-J5+P5","v":0},{"$f":"-K5+P5","v":0},{"$f":"-L5+P5","v":0},{"$f":"-M5+P5","v":0},{"$f":"-N5+P5","v":0},{"$f":"-O5+P5","v":0},0,null,"S10",0,0,0,0,0,0,0,0,0,0,null,{"$f":"IF(DonnéesFinales!Q$19=\"n/a\",\"\",\"T10\")","v":""},0,0,0,0,0,0,0,0,0,0,null,"",0,{"$f":"(1/($Q$3-1))*SUM(AL12:AL21)","v":0},0]
[]
[null,{"$f":"$C$47","v":0},{"$f":"C6","v":"SOCIAL - LOCAL"},"S1",0,{"$f":"-H6+G6","v":0},{"$f":"-I6+G6","v":0},{"$f":"-J6+G6","v":0},{"$f":"-K6+G6","v":0},{"$f":"-L6+G6","v":0},{"$f":"-M6+G6","v":0},{"$f":"-N6+G6","v":0},{"$f":"-O6+G6","v":0},{"$f":"-P6+G6","v":0},null,"S1",{"$f":"IF(E23<=0,0,1-EXP((-(E23^2))/(2*$B23^2)))","v":0},{"$f":"IF(F23<=0,0,1-EXP((-(F23^2))/(2*$B23^2)))","v":0},0,0,0,0,0,0,0,0]
[null,0,null,"S2",{"$f":"-G6+H6","v":0},0,{"$f":"-I6+H6","v":0},{"$f":"-J6+H6","v":0},{"$f":"-K6+H6","v":0},{"$f":"-L6+H6","v":0},{"$f":"-M6+H6","v":0},{"$f":"-N6+H6","v":0},{"$f":"-O6+H6","v":0},{"$f":"-P6+H6","v":0},null,"S2",{"$f":"IF(E24<=0,0,1-EXP((-(E24^2))/(2*$B24^2)))","v":0},{"$f":"IF(F24<=0,0,1-EXP((-(F24^2))/(2*$B24^2)))","v":0},{"$f":"IF(G24<=0,0,1-EXP((-(G24^2))/(2*$B24^2)))","v":0},{"$f":"IF(H24<=0,0,1-EXP((-(H24^2))/(2*$B24^2)))","v":0},{"$f":"IF(I24<=0,0,1-EXP((-(I24^2))/(2*$B24^2)))","v":0},{"$f":"IF(J24<=0,0,1-EXP((-(J24^2))/(2*$B24^2)))","v":0},{"$f":"IF(K24<=0,0,1-EXP((-(K24^2))/(2*$B24^2)))","v":0},{"$f":"IF(L24<=0,0,1-EXP((-(L24^2))/(2*$B24^2)))","v":0},{"$f":"IF(M24<=0,0,1-EXP((-(M24^2))/(2*$B24^2)))","v":0},{"$f":"IF(N24<=0,0,1-EXP((-(N24^2))/(2*$B24^2)))","v":0}]
[null,0,null,"S3",{"$f":"-G6+I6","v":0},{"$f":"-H6+I6","v":0},0,{"$f":"-J6+I6","v":0},{"$f":"-K6+I6","v":0},{"$f":"-L6+I6","v":0},{"$f":"-M6+I6","v":0},{"$f":"-N6+I6","v":0},{"$f":"-O6+I6","v":0},{"$f":"-P6+I6","v":0},null,"S3",0,0,0,0,0,0,0,0,0,0]
[null,0,null,"S4",{"$f":"-G6+J6","v":0},{"$f":"-H6+J6","v":0},{"$f":"-I6+J6","v":0},0,{"$f":"-K6+J6","v":0},{"$f":"-L6+J6","v":0},{"$f":"-M6+J6","v":0},{"$f":"-N6+J6","v":0},{"$f":"-O6+J6","v":0},{"$f":"-P6+J6","v":0},null,"S4",0,0,0,0,0,0,0,0,0,0]
[null,0,null,"S5",{"$f":"-G6+K6","v":0},{"$f":"-H6+K6","v":0},{"$f":"-I6+K6","v":0},{"$f":"-J6+K6","v":0},0,{"$f":"-L6+K6","v":0},{"$f":"-M6+K6","v":0},{"$f":"-N6+K6","v":0},{"$f":"-O6+K6","v":0},{"$f":"-P6+K6","v":0},null,"S5",0,0,0,0,0,0,0,0,0,0]
[null,0,null,"S6",{"$f":"-G6+L6","v":0},{"$f":"-H6+L6","v":0},{"$f":"-I6+L6","v":0},{"$f":"-J6+L6","v":0},{"$f":"-K6+L6","v":0},0,{"$f":"-M6+L6","v":0},{"$f":"-N6+L6","v":0},{"$f":"-O6+L6","v":0},{"$f":"-P6+L6","v":0},null,"S6",0,0,0,0,0,0,0,0,0,0]
[null,0,null,"S7",{"$f":"-G6+M6","v":0},{"$f":"-H6+M6","v":0},{"$f":"-I6+M6","v":0},{"$f":"-J6+M6","v":0},{"$f":"-K6+M6","v":0},{"$f":"-L6+M6","v":0},0,{"$f":"-N6+M6","v":0},{"$f":"-O6+M6","v":0},{"$f":"-P6+M6","v":0},null,"S7",0,0,0,0,0,0,0,0,0,0]
[null,0,null,"S8",{"$f":"-G6+N6","v":0},{"$f":"-H6+N6","v":0},{"$f":"-I6+N6","v":0},{"$f":"-J6+N6","v":0},{"$f":"-K6+N6","v":0},{"$f":"-L6+N6","v":0},{"$f":"-M6+N6","v":0},0,{"$f":"-O6+N6","v":0},{"$f":"-P6+N6","v":0},null,"S8",0,0,0,0,0,0,0,0,0,0]
[null,0,null,"S9",{"$f":"-G6+O6","v":0},{"$f":"-H6+O6","v":0},{"$f":"-I6+O6","v":0},{"$f":"-J6+O6","v":0},{"$f":"-K6+O6","v":0},{"$f":"-L6+O6","v":0},{"$f":"-M6+O6","v":0},{"$f":"-N6+O6","v":0},0,{"$f":"-P6+O6","v":0},null,"S9",0,0,0,0,0,0,0,0,0,0]
[null,0,null,"S10",{"$f":"-G6+P6","v":0},{"$f":"-H6+P6","v":0},{"$f":"-I6+P6","v":0},{"$f":"-J6+P6","v":0},{"$f":"-K6+P6","v":0},{"$f":"-L6+P6","v":0},{"$f":"-M6+P6","v":0},{"$f":"-N6+P6","v":0},{"$f":"-O6+P6","v":0},0,null,"S10",0,0,0,0,0,0,0,0,0,0]
[]
[]
[null,null,null,null,{"$f":"G4","v":""},"","","","","","","","",""]
[null,null,{"$f":"IF(E5=\"Min\",(MIN(E36:N45)-MAX(E36:N45))/2,(MAX(E36:N45)-MIN(E36:N45))/2)","v":0},{"$f":"G4","v":""},"x",{"$f":"IF(AND(F$35=\"\",$D36=\"\"),\"x\",IF($E$5=\"Min\",IF(F12<=0,F12,\"X\"), IF(F12>=0,F12,\"X\")))","v":"x"},"x","x","x","x","x","x","x","x"]
[null,null,null,{"$f":"H4","v":""},{"$f":"IF(AND(E$35=\"\",$D37=\"\"),\"x\",IF($E$5=\"Min\",IF(E13<=0,E13,\"X\"), IF(E13>=0,E13,\"X\")))","v":"x"},"x","x","x","x","x","x","x","x","x"]
[null,null,null,{"$f":"I4","v":""},{"$f":"IF(AND(E$35=\"\",$D38=\"\"),\"x\",IF($E$5=\"Min\",IF(E14<=0,E14,\"X\"), IF(E14>=0,E14,\"X\")))","v":"x"},"x","x","x","x","x","x","x","x","x"]
[null,null,null,{"$f":"J4","v":""},{"$f":"IF(AND(E$35=\"\",$D39=\"\"),\"x\",IF($E$5=\"Min\",IF(E15<=0,E15,\"X\"), IF(E15>=0,E15,\"X\")))","v":"x"},"x","x","x","x","x","x","x","x","x"]
[null,null,null,{"$f":"K4","v":""},{"$f":"IF(AND(E$35=\"\",$D40=\"\"),\"x\",IF($E$5=\"Min\",IF(E16<=0,E16,\"X\"), IF(E16>=0,E16,\"X\")))","v":"x"},"x","x","x","x","x","x","x","x","x"]
[null,null,null,{"$f":"L4","v":""},{"$f":"IF(AND(E$35=\"\",$D41=\"\"),\"x\",IF($E$5=\"Min\",IF(E17<=0,E17,\"X\"), IF(E17>=0,E17,\"X\")))","v":"x"},"x","x","x","x","x","x","x","x","x"]
[null,null,null,{"$f":"M4","v":""},{"$f":"IF(AND(E$35=\"\",$D42=\"\"),\"x\",IF($E$5=\"Min\",IF(E18<=0,E18,\"X\"), IF(E18>=0,E18,\"X\")))","v":"x"},"x","x","x","x","x","x","x","x","x"]
[null,null,null,{"$f":"N4","v":""},{"$f":"IF(AND(E$35=\"\",$D43=\"\"),\"x\",IF($E$5=\"Min\",IF(E19<=0,E19,\"X\"), IF(E19>=0,E19,\"X\")))","v":"x"},"x","x","x","x","x","x","x","x","x"]
[null,null,null,{"$f":"O4","v":""},{"$f":"IF(AND(E$35=\"\",$D44=\"\"),\"x\",IF($E$5=\"Min\",IF(E20<=0,E20,\"X\"), IF(E20>=0,E20,\"X\")))","v":"x"},"x","x","x","x","x","x","x","x","x"]
[null,null,null,{"$f":"P4","v":""},{"$f":"IF(AND(E$35=\"\",$D45=\"\"),\"x\",IF($E$5=\"Min\",IF(E21<=0,E21,\"X\"), IF(E21>=0,E21,\"X\")))","v":"x"},"x","x","x","x","x","x","x","x","x"]
[]
[null,null,{"$f":"IF(E6=\"Min\",(MIN(E47:N56)-MAX(E47:N56))/2,(MAX(E47:N56)-MIN(E47:N56))/2)","v":0},{"$f":"G4","v":""},"x",{"$f":"IF(AND(F$35=\"\",$D47=\"\"),\"x\",IF($E$6=\"Min\",IF(F23<=0,F23,\"X\"), IF(F23>=0,F23,\"bo\")))","v":"x"},"x","x","x","x","x","x","x","x"]
[null,null,null,{"$f":"H4","v":""},{"$f":"IF(AND(E$35=\"\",$D48=\"\"),\"x\",IF($E$6=\"Min\",IF(E24<=0,E24,\"X\"), IF(E24>=0,E24,\"bo\")))","v":"x"},"x","x","x","x","x","x","x","x","x"]
[null,null,null,{"$f":"I4","v":""},{"$f":"IF(AND(E$35=\"\",$D49=\"\"),\"x\",IF($E$6=\"Min\",IF(E25<=0,E25,\"X\"), IF(E25>=0,E25,\"bo\")))","v":"x"},"x","x","x","x","x","x","x","x","x"]
[null,null,null,{"$f":"J4","v":""},{"$f":"IF(AND(E$35=\"\",$D50=\"\"),\"x\",IF($E$6=\"Min\",IF(E26<=0,E26,\"X\"), IF(E26>=0,E26,\"bo\")))","v":"x"},"x","x","x",{"$f":"IF(AND(I$35=\"\",$D50=\"\"),\"x\",IF($E$6=\"Min\",IF(I26<=0,I26,\"X\"), IF(I26>=0,I26,\"bo\")))","v":"x"},"x","x","x","x","x"]
[null,null,null,{"$f":"K4","v":""},{"$f":"IF(AND(E$35=\"\",$D51=\"\"),\"x\",IF($E$6=\"Min\",IF(E27<=0,E27,\"X\"), IF(E27>=0,E27,\"bo\")))","v":"x"},"x","x","x","x","x","x","x","x","x"]
[null,null,null,{"$f":"L4","v":""},{"$f":"IF(AND(E$35=\"\",$D52=\"\"),\"x\",IF($E$6=\"Min\",IF(E28<=0,E28,\"X\"), IF(E28>=0,E28,\"bo\")))","v":"x"},"x","x","x","x","x","x","x","x","x"]
[null,null,null,{"$f":"M4","v":""},{"$f":"IF(AND(E$35=\"\",$D53=\"\"),\"x\",IF($E$6=\"Min\",IF(E29<=0,E29,\"X\"), IF(E29>=0,E29,\"bo\")))","v":"x"},"x","x","x","x","x","x","x","x","x"]
[null,null,null,{"$f":"N4","v":""},{"$f":"IF(AND(E$35=\"\",$D54=\"\"),\"x\",IF($E$6=\"Min\",IF(E30<=0,E30,\"X\"), IF(E30>=0,E30,\"bo\")))","v":"x"},"x","x","x","x","x","x","x","x","x"]
[null,null,null,{"$f":"O4","v":""},{"$f":"IF(AND(E$35=\"\",$D55=\"\"),\"x\",IF($E$6=\"Min\",IF(E31<=0,E31,\"X\"), IF(E31>=0,E31,\"bo\")))","v":"x"},"x","x","x","x","x","x","x","x","x"]
[null,null,null,{"$f":"P4","v":""},{"$f":"IF(AND(E$35=\"\",$D56=\"\"),\"x\",IF($E$6=\"Min\",IF(E32<=0,E32,\"X\"), IF(E32>=0,E32,\"bo\")))","v":"x"},"x","x","x",{"$f":"IF(AND(I$35=\"\",$D56=\"\"),\"x\",IF($E$6=\"Min\",IF(I32<=0,I32,\"X\"), IF(I32>=0,I32,\"bo\")))","v":"x"},{"$f":"IF(AND(J$35=\"\",$D56=\"\"),\"x\",IF($E$6=\"Min\",IF(J32<=0,J32,\"X\"), IF(J32>=0,J32,\"bo\")))","v":"x"},"x","x","x","x"]

{"sheet":"Coûts","index":18,"n_rows":103,"n_cols":43,"rows_kept":103,"cut":false,"hidden":true,"merged":[[24,2,33,2],[35,2,44,2],[46,2,55,2],[1,2,1,38],[11,4,11,13],[11,16,11,25],[11,28,11,37],[13,2,22,2],[71,2,80,2],[82,2,91,2],[93,2,102,2],[58,4,58,13],[60,2,69,2]]}
[]
[null,null,"COÛT"]
[null,null,null,null,null,null,{"$f":"IF(G4=\"\",0,1)","v":0},0,0,0,0,0,0,0,0,0,{"$f":"SUM(G3:P3)","v":0}]
[null,{"$f":"SUM(B5:B8)","v":1},null,null,null,null,{"$f":"IF(DonnéesFinales!H$19=\"n/a\",\"\",\"T1\")","v":""},{"$f":"IF(DonnéesFinales!I$19=\"n/a\",\"\",\"T2\")","v":""},{"$f":"IF(DonnéesFinales!J$19=\"n/a\",\"\",\"T3\")","v":""},{"$f":"IF(DonnéesFinales!K$19=\"n/a\",\"\",\"T4\")","v":""},{"$f":"IF(DonnéesFinales!L$19=\"n/a\",\"\",\"T5\")","v":""},{"$f":"IF(DonnéesFinales!M$19=\"n/a\",\"\",\"T6\")","v":""},{"$f":"IF(DonnéesFinales!N$19=\"n/a\",\"\",\"T7\")","v":""},{"$f":"IF(DonnéesFinales!O$19=\"n/a\",\"\",\"T8\")","v":""},{"$f":"IF(DonnéesFinales!P$19=\"n/a\",\"\",\"T9\")","v":""},{"$f":"IF(DonnéesFinales!Q$19=\"n/a\",\"\",\"T10\")","v":""},null,true,false]
[null,{"$f":"IF(Q5=TRUE,1,0)","v":1},{"$f":"DonnéesFinales!D22","v":"Coût d’investissement et de fonctionnement"},{"$f":"R5+IF(Q5=TRUE,$S$9/$B$4,0%)","v":1},{"$f":"DonnéesFinales!F22","v":"Min"},{"$f":"DonnéesFinales!G22","v":"Unité"},{"$f":"IF(OR(DonnéesFinales!$R22=FALSE,G$4=\"\"),0,DonnéesFinales!H22)","v":0},{"$f":"IF(OR(DonnéesFinales!$R22=FALSE,H$4=\"\"),0,DonnéesFinales!I22)","v":0},{"$f":"IF(OR(DonnéesFinales!$R22=FALSE,I$4=\"\"),0,DonnéesFinales!J22)","v":0},{"$f":"IF(OR(DonnéesFinales!$R22=FALSE,J$4=\"\"),0,DonnéesFinales!K22)","v":0},{"$f":"IF(OR(DonnéesFinales!$R22=FALSE,K$4=\"\"),0,DonnéesFinales!L22)","v":0},{"$f":"IF(OR(DonnéesFinales!$R22=FALSE,L$4=\"\"),0,DonnéesFinales!M22)","v":0},{"$f":"IF(OR(DonnéesFinales!$R22=FALSE,M$4=\"\"),0,DonnéesFinales!N22)","v":0},{"$f":"IF(OR(DonnéesFinales!$R22=FALSE,N$4=\"\"),0,DonnéesFinales!O22)","v":0},{"$f":"IF(OR(DonnéesFinales!$R22=FALSE,O$4=\"\"),0,DonnéesFinales!P22)","v":0},{"$f":"IF(OR(DonnéesFinales!$R22=FALSE,P$4=\"\"),0,DonnéesFinales!Q22)","v":0},{"$f":"DonnéesFinales!$R22","v":true},{"$f":"IF(Q5=TRUE,31.02%,0)","v":0.31019999999999998},{"$f":"IF(Q5=FALSE,31.02%,0)","v":0}]
[null,{"$f":"IF(Q6=TRUE,1,0)","v":0},{"$f":"DonnéesFinales!D23","v":"Coût de mesures de sécurité et de suivi"},{"$f":"R6+IF(Q6=TRUE,$S$9/$B$4,0%)","v":0},{"$f":"DonnéesFinales!F23","v":"Min"},{"$f":"DonnéesFinales!G23","v":"Unité"},{"$f":"IF(OR(DonnéesFinales!$R23=FALSE,G$4=\"\"),0,DonnéesFinales!H23)","v":0},{"$f":"IF(OR(DonnéesFinales!$R23=FALSE,H$4=\"\"),0,DonnéesFinales!I23)","v":0},{"$f":"IF(OR(DonnéesFinales!$R23=FALSE,I$4=\"\"),0,DonnéesFinales!J23)","v":0},{"$f":"IF(OR(DonnéesFinales!$R23=FALSE,J$4=\"\"),0,DonnéesFinales!K23)","v":0},{"$f":"IF(OR(DonnéesFinales!$R23=FALSE,K$4=\"\"),0,DonnéesFinales!L23)","v":0},{"$f":"IF(OR(DonnéesFinales!$R23=FALSE,L$4=\"\"),0,DonnéesFinales!M23)","v":0},{"$f":"IF(OR(DonnéesFinales!$R23=FALSE,M$4=\"\"),0,DonnéesFinales!N23)","v":0},{"$f":"IF(OR(DonnéesFinales!$R23=FALSE,N$4=\"\"),0,DonnéesFinales!O23)","v":0},{"$f":"IF(OR(DonnéesFinales!$R23=FALSE,O$4=\"\"),0,DonnéesFinales!P23)","v":0},{"$f":"IF(OR(DonnéesFinales!$R23=FALSE,P$4=\"\"),0,DonnéesFinales!Q23)","v":0},{"$f":"DonnéesFinales!$R23","v":false},{"$f":"IF(Q6=TRUE,12.65%,0)","v":0},{"$f":"IF(Q6=FALSE,12.65%,0)","v":0.1265}]
[null,0,{"$f":"DonnéesFinales!D24","v":"Coût des mesures complémentaires et compensatoires"},0,{"$f":"DonnéesFinales!F24","v":"Min"},{"$f":"DonnéesFinales!G24","v":"Unité"},{"$f":"IF(OR(DonnéesFinales!$R24=FALSE,G$4=\"\"),0,DonnéesFinales!H24)","v":0},{"$f":"IF(OR(DonnéesFinales!$R24=FALSE,H$4=\"\"),0,DonnéesFinales!I24)","v":0},{"$f":"IF(OR(DonnéesFinales!$R24=FALSE,I$4=\"\"),0,DonnéesFinales!J24)","v":0},{"$f":"IF(OR(DonnéesFinales!$R24=FALSE,J$4=\"\"),0,DonnéesFinales!K24)","v":0},{"$f":"IF(OR(DonnéesFinales!$R24=FALSE,K$4=\"\"),0,DonnéesFinales!L24)","v":0},{"$f":"IF(OR(DonnéesFinales!$R24=FALSE,L$4=\"\"),0,DonnéesFinales!M24)","v":0},{"$f":"IF(OR(DonnéesFinales!$R24=FALSE,M$4=\"\"),0,DonnéesFinales!N24)","v":0},{"$f":"IF(OR(DonnéesFinales!$R24=FALSE,N$4=\"\"),0,DonnéesFinales!O24)","v":0},{"$f":"IF(OR(DonnéesFinales!$R24=FALSE,O$4=\"\"),0,DonnéesFinales!P24)","v":0},{"$f":"IF(OR(DonnéesFinales!$R24=FALSE,P$4=\"\"),0,DonnéesFinales!Q24)","v":0},{"$f":"DonnéesFinales!$R24","v":false},{"$f":"IF(Q7=TRUE,25.31%,0)","v":0},{"$f":"IF(Q7=FALSE,25.31%,0)","v":0.25309999999999999}]
[null,0,{"$f":"DonnéesFinales!D25","v":"Persistance de pollutions résiduelles et usage du terrain"},0,{"$f":"DonnéesFinales!F25","v":"Min"},{"$f":"DonnéesFinales!G25","v":"Unité"},{"$f":"IF(OR(DonnéesFinales!$R25=FALSE,G$4=\"\"),0,DonnéesFinales!H25)","v":0},{"$f":"IF(OR(DonnéesFinales!$R25=FALSE,H$4=\"\"),0,DonnéesFinales!I25)","v":0},{"$f":"IF(OR(DonnéesFinales!$R25=FALSE,I$4=\"\"),0,DonnéesFinales!J25)","v":0},{"$f":"IF(OR(DonnéesFinales!$R25=FALSE,J$4=\"\"),0,DonnéesFinales!K25)","v":0},{"$f":"IF(OR(DonnéesFinales!$R25=FALSE,K$4=\"\"),0,DonnéesFinales!L25)","v":0},{"$f":"IF(OR(DonnéesFinales!$R25=FALSE,L$4=\"\"),0,DonnéesFinales!M25)","v":0},{"$f":"IF(OR(DonnéesFinales!$R25=FALSE,M$4=\"\"),0,DonnéesFinales!N25)","v":0},{"$f":"IF(OR(DonnéesFinales!$R25=FALSE,N$4=\"\"),0,DonnéesFinales!O25)","v":0},{"$f":"IF(OR(DonnéesFinales!$R25=FALSE,O$4=\"\"),0,DonnéesFinales!P25)","v":0},{"$f":"IF(OR(DonnéesFinales!$R25=FALSE,P$4=\"\"),0,DonnéesFinales!Q25)","v":0},{"$f":"DonnéesFinales!$R25","v":false},{"$f":"IF(Q8=TRUE,31.02%,0)","v":0},{"$f":"IF(Q8=FALSE,31.02%,0)","v":0.31019999999999998}]
[null,null,"TOT",null,null,null,{"$f":"SUM(G5:G8)","v":0},{"$f":"SUM(H5:H8)","v":0},0,0,0,0,0,0,0,0,null,null,{"$f":"SUM(S5:S8)","v":0.68979999999999997}]
[]
[]
[null,"Sigma",null,1,"Comparaison par paire dk(ai,bj)",null,null,null,null,null,null,null,null,null,null,2,"Fonction de préférence F(dk(ai,bj))",null,null,null,null,null,null,null,null,null,null,3,"Degrée de préférence π(a,b)",null,null,null,null,null,null,null,null,null,null,4,"Flots de surclassement ф(ai,x)"]
[null,null,null,null,"S1","S2","S3","S4","S5","S6","S7","S8","S9","S10",null,null,"S1","S2","S3","S4","S5","S6","S7","S8","S9","S10",null,null,{"$f":"AB14","v":""},{"$f":"AB15","v":""},{"$f":"AB16","v":""},{"$f":"AB17","v":""},{"$f":"AB18","v":""},{"$f":"AB19","v":""},{"$f":"AB20","v":""},{"$f":"AB21","v":""},{"$f":"AB22","v":""},{"$f":"AB23","v":""},null,null,"ф-(x,a)","ф+(a,x)","ф(a,x)"]
[null,{"$f":"$C$61/2","v":0},{"$f":"C5","v":"Coût d’investissement et de fonctionnement"},"S1",0,{"$f":"-H5+G5","v":0},{"$f":"-I5+G5","v":0},{"$f":"-J5+G5","v":0},{"$f":"-K5+G5","v":0},{"$f":"-L5+G5","v":0},{"$f":"-M5+G5","v":0},{"$f":"-N5+G5","v":0},{"$f":"-O5+G5","v":0},{"$f":"-P5+G5","v":0},null,"S1",{"$f":"IF(E14<=0,0,1-EXP((-(E14^2))/(2*$B14^2)))","v":0},{"$f":"IF(F14<=0,0,1-EXP((-(F14^2))/(2*$B14^2)))","v":0},0,0,0,0,0,0,0,0,null,{"$f":"IF(DonnéesFinales!H$19=\"n/a\",\"\",\"T1\")","v":""},{"$f":"IF(OR($AB14=\"\",AC$13=\"\"),0,Q14*$D$5+Q25*$D$6+Q36*$D$7+Q47*$D$8)","v":0},{"$f":"IF(OR($AB14=\"\",AD$13=\"\"),0,R14*$D$5+R25*$D$6+R36*$D$7+R47*$D$8)","v":0},{"$f":"IF(OR($AB14=\"\",AE$13=\"\"),0,S14*$D$5+S25*$D$6+S36*$D$7+S47*$D$8)","v":0},{"$f":"IF(OR($AB14=\"\",AF$13=\"\"),0,T14*$D$5+T25*$D$6+T36*$D$7+T47*$D$8)","v":0},{"$f":"IF(OR($AB14=\"\",AG$13=\"\"),0,U14*$D$5+U25*$D$6+U36*$D$7+U47*$D$8)","v":0},{"$f":"IF(OR($AB14=\"\",AH$13=\"\"),0,V14*$D$5+V25*$D$6+V36*$D$7+V47*$D$8)","v":0},{"$f":"IF(OR($AB14=\"\",AI$13=\"\"),0,W14*$D$5+W25*$D$6+W36*$D$7+W47*$D$8)","v":0},{"$f":"IF(OR($AB14=\"\",AJ$13=\"\"),0,X14*$D$5+X25*$D$6+X36*$D$7+X47*$D$8)","v":0},{"$f":"IF(OR($AB14=\"\",AK$13=\"\"),0,Y14*$D$5+Y25*$D$6+Y36*$D$7+Y47*$D$8)","v":0},{"$f":"IF(OR($AB14=\"\",AL$13=\"\"),0,Z14*$D$5+Z25*$D$6+Z36*$D$7+Z47*$D$8)","v":0},null,"P1",{"$f":"(1/($Q$3-1))*SUM(AC14:AL14)","v":0},{"$f":"(1/($Q$3-1))*SUM(AC14:AC23)","v":0},{"$f":"AP14-AO14","v":0}]
[null,{"$f":"$C$61/2","v":0},null,"S2",{"$f":"-G5+H5","v":0},0,{"$f":"-I5+H5","v":0},{"$f":"-J5+H5","v":0},{"$f":"-K5+H5","v":0},{"$f":"-L5+H5","v":0},{"$f":"-M5+H5","v":0},{"$f":"-N5+H5","v":0},{"$f":"-O5+H5","v":0},{"$f":"-P5+H5","v":0},null,"S2",{"$f":"IF(E15<=0,0,1-EXP((-(E15^2))/(2*$B15^2)))","v":0},{"$f":"IF(F15<=0,0,1-EXP((-(F15^2))/(2*$B15^2)))","v":0},{"$f":"IF(G15<=0,0,1-EXP((-(G15^2))/(2*$B15^2)))","v":0},{"$f":"IF(H15<=0,0,1-EXP((-(H15^2))/(2*$B15^2)))","v":0},{"$f":"IF(I15<=0,0,1-EXP((-(I15^2))/(2*$B15^2)))","v":0},{"$f":"IF(J15<=0,0,1-EXP((-(J15^2))/(2*$B15^2)))","v":0},{"$f":"IF(K15<=0,0,1-EXP((-(K15^2))/(2*$B15^2)))","v":0},{"$f":"IF(L15<=0,0,1-EXP((-(L15^2))/(2*$B15^2)))","v":0},{"$f":"IF(M15<=0,0,1-EXP((-(M15^2))/(2*$B15^2)))","v":0},{"$f":"IF(N15<=0,0,1-EXP((-(N15^2))/(2*$B15^2)))","v":0},null,{"$f":"IF(DonnéesFinales!I$19=\"n/a\",\"\",\"T2\")","v":""},0,{"$f":"IF(OR($AB15=\"\",AD$13=\"\"),0,R15*$D$5+R26*$D$6+R37*$D$7+R48*$D$8)","v":0},0,0,0,0,0,0,0,0,null,"P2",{"$f":"(1/($Q$3-1))*SUM(AC15:AL15)","v":0},{"$f":"(1/($Q$3-1))*SUM(AD14:AD23)","v":0},{"$f":"AP15-AO15","v":0}]
[null,0,null,"S3",{"$f":"-G5+I5","v":0},{"$f":"-H5+I5","v":0},0,{"$f":"-J5+I5","v":0},{"$f":"-K5+I5","v":0},{"$f":"-L5+I5","v":0},{"$f":"-M5+I5","v":0},{"$f":"-N5+I5","v":0},{"$f":"-O5+I5","v":0},{"$f":"-P5+I5","v":0},null,"S3",0,0,0,0,0,0,0,0,0,0,null,{"$f":"IF(DonnéesFinales!J$19=\"n/a\",\"\",\"T3\")","v":""},0,0,0,0,0,0,0,0,0,0,null,"P3",0,{"$f":"(1/($Q$3-1))*SUM(AE14:AE23)","v":0},0]
[null,0,null,"S4",{"$f":"-G5+J5","v":0},{"$f":"-H5+J5","v":0},{"$f":"-I5+J5","v":0},0,{"$f":"-K5+J5","v":0},{"$f":"-L5+J5","v":0},{"$f":"-M5+J5","v":0},{"$f":"-N5+J5","v":0},{"$f":"-O5+J5","v":0},{"$f":"-P5+J5","v":0},null,"S4",0,0,0,0,0,0,0,0,0,0,null,{"$f":"IF(DonnéesFinales!K$19=\"n/a\",\"\",\"T4\")","v":""},0,0,0,0,0,0,0,0,0,0,null,"P4",0,{"$f":"(1/($Q$3-1))*SUM(AF14:AF23)","v":0},0]
[null,0,null,"S5",{"$f":"-G5+K5","v":0},{"$f":"-H5+K5","v":0},{"$f":"-I5+K5","v":0},{"$f":"-J5+K5","v":0},0,{"$f":"-L5+K5","v":0},{"$f":"-M5+K5","v":0},{"$f":"-N5+K5","v":0},{"$f":"-O5+K5","v":0},{"$f":"-P5+K5","v":0},null,"S5",0,0,0,0,0,0,0,0,0,0,null,{"$f":"IF(DonnéesFinales!L$19=\"n/a\",\"\",\"T5\")","v":""},0,0,0,0,0,0,0,0,0,0,null,"P5",0,{"$f":"(1/($Q$3-1))*SUM(AG14:AG23)","v":0},0]
[null,0,null,"S6",{"$f":"-G5+L5","v":0},{"$f":"-H5+L5","v":0},{"$f":"-I5+L5","v":0},{"$f":"-J5+L5","v":0},{"$f":"-K5+L5","v":0},0,{"$f":"-M5+L5","v":0},{"$f":"-N5+L5","v":0},{"$f":"-O5+L5","v":0},{"$f":"-P5+L5","v":0},null,"S6",0,0,0,0,0,0,0,0,0,0,null,{"$f":"IF(DonnéesFinales!M$19=\"n/a\",\"\",\"T6\")","v":""},0,0,0,0,0,0,0,0,0,0,null,"P6",0,{"$f":"(1/($Q$3-1))*SUM(AH14:AH23)","v":0},0]
[null,0,null,"S7",{"$f":"-G5+M5","v":0},{"$f":"-H5+M5","v":0},{"$f":"-I5+M5","v":0},{"$f":"-J5+M5","v":0},{"$f":"-K5+M5","v":0},{"$f":"-L5+M5","v":0},0,{"$f":"-N5+M5","v":0},{"$f":"-O5+M5","v":0},{"$f":"-P5+M5","v":0},null,"S7",0,0,0,0,0,0,0,0,0,0,null,{"$f":"IF(DonnéesFinales!N$19=\"n/a\",\"\",\"T7\")","v":""},0,0,0,0,0,0,0,0,0,0,null,"P7",0,{"$f":"(1/($Q$3-1))*SUM(AI14:AI23)","v":0},0]
[null,0,null,"S8",{"$f":"-G5+N5","v":0},{"$f":"-H5+N5","v":0},{"$f":"-I5+N5","v":0},{"$f":"-J5+N5","v":0},{"$f":"-K5+N5","v":0},{"$f":"-L5+N5","v":0},{"$f":"-M5+N5","v":0},0,{"$f":"-O5+N5","v":0},{"$f":"-P5+N5","v":0},null,"S8",0,0,0,0,0,0,0,0,0,0,null,{"$f":"IF(DonnéesFinales!O$19=\"n/a\",\"\",\"T8\")","v":""},0,0,0,0,0,0,0,0,0,0,null,"P8",0,{"$f":"(1/($Q$3-1))*SUM(AJ14:AJ23)","v":0},0]
[null,0,null,"S9",{"$f":"-G5+O5","v":0},{"$f":"-H5+O5","v":0},{"$f":"-I5+O5","v":0},{"$f":"-J5+O5","v":0},{"$f":"-K5+O5","v":0},{"$f":"-L5+O5","v":0},{"$f":"-M5+O5","v":0},{"$f":"-N5+O5","v":0},0,{"$f":"-P5+O5","v":0},null,"S9",0,0,0,0,0,0,0,0,0,0,null,{"$f":"IF(DonnéesFinales!P$19=\"n/a\",\"\",\"T9\")","v":""},0,0,0,0,0,0,0,0,0,0,null,"P9",0,{"$f":"(1/($Q$3-1))*SUM(AK14:AK23)","v":0},0]
[null,0,null,"S10",{"$f":"-G5+P5","v":0},{"$f":"-H5+P5","v":0},{"$f":"-I5+P5","v":0},{"$f":"-J5+P5","v":0},{"$f":"-K5+P5","v":0},{"$f":"-L5+P5","v":0},{"$f":"-M5+P5","v":0},{"$f":"-N5+P5","v":0},{"$f":"-O5+P5","v":0},0,null,"S10",0,0,0,0,0,0,0,0,0,0,null,{"$f":"IF(DonnéesFinales!Q$19=\"n/a\",\"\",\"T10\")","v":""},0,0,0,0,0,0,0,0,0,0,null,"P10",0,{"$f":"(1/($Q$3-1))*SUM(AL14:AL23)","v":0},0]
[]
[null,{"$f":"$C$72/2","v":0},{"$f":"C6","v":"Coût de mesures de sécurité et de suivi"},"S1",0,{"$f":"-H6+G6","v":0},{"$f":"-I6+G6","v":0},{"$f":"-J6+G6","v":0},{"$f":"-K6+G6","v":0},{"$f":"-L6+G6","v":0},{"$f":"-M6+G6","v":0},{"$f":"-N6+G6","v":0},{"$f":"-O6+G6","v":0},{"$f":"-P6+G6","v":0},null,"S1",{"$f":"IF(E25<=0,0,1-EXP((-(E25^2))/(2*$B25^2)))","v":0},{"$f":"IF(F25<=0,0,1-EXP((-(F25^2))/(2*$B25^2)))","v":0},{"$f":"IF(G25<=0,0,1-EXP((-(G25^2))/(2*$B25^2)))","v":0},{"$f":"IF(H25<=0,0,1-EXP((-(H25^2))/(2*$B25^2)))","v":0},{"$f":"IF(I25<=0,0,1-EXP((-(I25^2))/(2*$B25^2)))","v":0},{"$f":"IF(J25<=0,0,1-EXP((-(J25^2))/(2*$B25^2)))","v":0},{"$f":"IF(K25<=0,0,1-EXP((-(K25^2))/(2*$B25^2)))","v":0},{"$f":"IF(L25<=0,0,1-EXP((-(L25^2))/(2*$B25^2)))","v":0},{"$f":"IF(M25<=0,0,1-EXP((-(M25^2))/(2*$B25^2)))","v":0},{"$f":"IF(N25<=0,0,1-EXP((-(N25^2))/(2*$B25^2)))","v":0}]
[null,{"$f":"$C$72/2","v":0},null,"S2",{"$f":"-G6+H6","v":0},0,{"$f":"-I6+H6","v":0},{"$f":"-J6+H6","v":0},{"$f":"-K6+H6","v":0},{"$f":"-L6+H6","v":0},{"$f":"-M6+H6","v":0},{"$f":"-N6+H6","v":0},{"$f":"-O6+H6","v":0},{"$f":"-P6+H6","v":0},null,"S2",{"$f":"IF(E26<=0,0,1-EXP((-(E26^2))/(2*$B26^2)))","v":0},0,0,0,0,0,0,0,0,0]
[null,0,null,"S3",{"$f":"-G6+I6","v":0},{"$f":"-H6+I6","v":0},0,{"$f":"-J6+I6","v":0},{"$f":"-K6+I6","v":0},{"$f":"-L6+I6","v":0},{"$f":"-M6+I6","v":0},{"$f":"-N6+I6","v":0},{"$f":"-O6+I6","v":0},{"$f":"-P6+I6","v":0},null,"S3",0,0,0,0,0,0,0,0,0,0]
[null,0,null,"S4",{"$f":"-G6+J6","v":0},{"$f":"-H6+J6","v":0},{"$f":"-I6+J6","v":0},0,{"$f":"-K6+J6","v":0},{"$f":"-L6+J6","v":0},{"$f":"-M6+J6","v":0},{"$f":"-N6+J6","v":0},{"$f":"-O6+J6","v":0},{"$f":"-P6+J6","v":0},null,"S4",0,0,0,0,0,0,0,0,0,0]
[null,0,null,"S5",{"$f":"-G6+K6","v":0},{"$f":"-H6+K6","v":0},{"$f":"-I6+K6","v":0},{"$f":"-J6+K6","v":0},0,{"$f":"-L6+K6","v":0},{"$f":"-M6+K6","v":0},{"$f":"-N6+K6","v":0},{"$f":"-O6+K6","v":0},{"$f":"-P6+K6","v":0},null,"S5",0,0,0,0,0,0,0,0,0,0]
[null,0,null,"S6",{"$f":"-G6+L6","v":0},{"$f":"-H6+L6","v":0},{"$f":"-I6+L6","v":0},{"$f":"-J6+L6","v":0},{"$f":"-K6+L6","v":0},0,{"$f":"-M6+L6","v":0},{"$f":"-N6+L6","v":0},{"$f":"-O6+L6","v":0},{"$f":"-P6+L6","v":0},null,"S6",0,0,0,0,0,0,0,0,0,0]
[null,0,null,"S7",{"$f":"-G6+M6","v":0},{"$f":"-H6+M6","v":0},{"$f":"-I6+M6","v":0},{"$f":"-J6+M6","v":0},{"$f":"-K6+M6","v":0},{"$f":"-L6+M6","v":0},0,{"$f":"-N6+M6","v":0},{"$f":"-O6+M6","v":0},{"$f":"-P6+M6","v":0},null,"S7",0,0,0,0,0,0,0,0,0,0]
[null,0,null,"S8",{"$f":"-G6+N6","v":0},{"$f":"-H6+N6","v":0},{"$f":"-I6+N6","v":0},{"$f":"-J6+N6","v":0},{"$f":"-K6+N6","v":0},{"$f":"-L6+N6","v":0},{"$f":"-M6+N6","v":0},0,{"$f":"-O6+N6","v":0},{"$f":"-P6+N6","v":0},null,"S8",0,0,0,0,0,0,0,0,0,0]
[null,0,null,"S9",{"$f":"-G6+O6","v":0},{"$f":"-H6+O6","v":0},{"$f":"-I6+O6","v":0},{"$f":"-J6+O6","v":0},{"$f":"-K6+O6","v":0},{"$f":"-L6+O6","v":0},{"$f":"-M6+O6","v":0},{"$f":"-N6+O6","v":0},0,{"$f":"-P6+O6","v":0},null,"S9",0,0,0,0,0,0,0,0,0,0]
[null,0,null,"S10",{"$f":"-G6+P6","v":0},{"$f":"-H6+P6","v":0},{"$f":"-I6+P6","v":0},{"$f":"-J6+P6","v":0},{"$f":"-K6+P6","v":0},{"$f":"-L6+P6","v":0},{"$f":"-M6+P6","v":0},{"$f":"-N6+P6","v":0},{"$f":"-O6+P6","v":0},0,null,"S10",0,0,0,0,0,0,0,0,0,0]
[]
[null,{"$f":"$C$83/2","v":0},{"$f":"C7","v":"Coût des mesures complémentaires et compensatoires"},"S1",0,{"$f":"-H7+G7","v":0},{"$f":"-I7+G7","v":0},{"$f":"-J7+G7","v":0},{"$f":"-K7+G7","v":0},{"$f":"-L7+G7","v":0},{"$f":"-M7+G7","v":0},{"$f":"-N7+G7","v":0},{"$f":"-O7+G7","v":0},{"$f":"-P7+G7","v":0},null,"S1",{"$f":"IF(E36<=0,0,1-EXP((-(E36^2))/(2*$B36^2)))","v":0},{"$f":"IF(F36<=0,0,1-EXP((-(F36^2))/(2*$B36^2)))","v":0},{"$f":"IF(G36<=0,0,1-EXP((-(G36^2))/(2*$B36^2)))","v":0},{"$f":"IF(H36<=0,0,1-EXP((-(H36^2))/(2*$B36^2)))","v":0},{"$f":"IF(I36<=0,0,1-EXP((-(I36^2))/(2*$B36^2)))","v":0},{"$f":"IF(J36<=0,0,1-EXP((-(J36^2))/(2*$B36^2)))","v":0},{"$f":"IF(K36<=0,0,1-EXP((-(K36^2))/(2*$B36^2)))","v":0},{"$f":"IF(L36<=0,0,1-EXP((-(L36^2))/(2*$B36^2)))","v":0},{"$f":"IF(M36<=0,0,1-EXP((-(M36^2))/(2*$B36^2)))","v":0},{"$f":"IF(N36<=0,0,1-EXP((-(N36^2))/(2*$B36^2)))","v":0}]
[null,{"$f":"$C$83/2","v":0},null,"S2",{"$f":"-G7+H7","v":0},0,{"$f":"-I7+H7","v":0},{"$f":"-J7+H7","v":0},{"$f":"-K7+H7","v":0},{"$f":"-L7+H7","v":0},{"$f":"-M7+H7","v":0},{"$f":"-N7+H7","v":0},{"$f":"-O7+H7","v":0},{"$f":"-P7+H7","v":0},null,"S2",{"$f":"IF(E37<=0,0,1-EXP((-(E37^2))/(2*$B37^2)))","v":0},0,0,0,0,0,0,0,0,0]
[null,0,null,"S3",{"$f":"-G7+I7","v":0},{"$f":"-H7+I7","v":0},0,{"$f":"-J7+I7","v":0},{"$f":"-K7+I7","v":0},{"$f":"-L7+I7","v":0},{"$f":"-M7+I7","v":0},{"$f":"-N7+I7","v":0},{"$f":"-O7+I7","v":0},{"$f":"-P7+I7","v":0},null,"S3",0,0,0,0,0,0,0,0,0,0]
[null,0,null,"S4",{"$f":"-G7+J7","v":0},{"$f":"-H7+J7","v":0},{"$f":"-I7+J7","v":0},0,{"$f":"-K7+J7","v":0},{"$f":"-L7+J7","v":0},{"$f":"-M7+J7","v":0},{"$f":"-N7+J7","v":0},{"$f":"-O7+J7","v":0},{"$f":"-P7+J7","v":0},null,"S4",0,0,0,0,0,0,0,0,0,0]
[null,0,null,"S5",{"$f":"-G7+K7","v":0},{"$f":"-H7+K7","v":0},{"$f":"-I7+K7","v":0},{"$f":"-J7+K7","v":0},0,{"$f":"-L7+K7","v":0},{"$f":"-M7+K7","v":0},{"$f":"-N7+K7","v":0},{"$f":"-O7+K7","v":0},{"$f":"-P7+K7","v":0},null,"S5",0,0,0,0,0,0,0,0,0,0]
[null,0,null,"S6",{"$f":"-G7+L7","v":0},{"$f":"-H7+L7","v":0},{"$f":"-I7+L7","v":0},{"$f":"-J7+L7","v":0},{"$f":"-K7+L7","v":0},0,{"$f":"-M7+L7","v":0},{"$f":"-N7+L7","v":0},{"$f":"-O7+L7","v":0},{"$f":"-P7+L7","v":0},null,"S6",0,0,0,0,0,0,0,0,0,0]
[null,0,null,"S7",{"$f":"-G7+M7","v":0},{"$f":"-H7+M7","v":0},{"$f":"-I7+M7","v":0},{"$f":"-J7+M7","v":0},{"$f":"-K7+M7","v":0},{"$f":"-L7+M7","v":0},0,{"$f":"-N7+M7","v":0},{"$f":"-O7+M7","v":0},{"$f":"-P7+M7","v":0},null,"S7",0,0,0,0,0,0,0,0,0,0]
[null,0,null,"S8",{"$f":"-G7+N7","v":0},{"$f":"-H7+N7","v":0},{"$f":"-I7+N7","v":0},{"$f":"-J7+N7","v":0},{"$f":"-K7+N7","v":0},{"$f":"-L7+N7","v":0},{"$f":"-M7+N7","v":0},0,{"$f":"-O7+N7","v":0},{"$f":"-P7+N7","v":0},null,"S8",0,0,0,0,0,0,0,0,0,0]
[null,0,null,"S9",{"$f":"-G7+O7","v":0},{"$f":"-H7+O7","v":0},{"$f":"-I7+O7","v":0},{"$f":"-J7+O7","v":0},{"$f":"-K7+O7","v":0},{"$f":"-L7+O7","v":0},{"$f":"-M7+O7","v":0},{"$f":"-N7+O7","v":0},0,{"$f":"-P7+O7","v":0},null,"S9",0,0,0,0,0,0,0,0,0,0]
[null,0,null,"S10",{"$f":"-G7+P7","v":0},{"$f":"-H7+P7","v":0},{"$f":"-I7+P7","v":0},{"$f":"-J7+P7","v":0},{"$f":"-K7+P7","v":0},{"$f":"-L7+P7","v":0},{"$f":"-M7+P7","v":0},{"$f":"-N7+P7","v":0},{"$f":"-O7+P7","v":0},0,null,"S10",0,0,0,0,0,0,0,0,0,0]
[]
[null,{"$f":"$C$94/2","v":0},{"$f":"C8","v":"Persistance de pollutions résiduelles et usage du terrain"},"S1",0,{"$f":"-H8+G8","v":0},{"$f":"-I8+G8","v":0},{"$f":"-J8+G8","v":0},{"$f":"-K8+G8","v":0},{"$f":"-L8+G8","v":0},{"$f":"-M8+G8","v":0},{"$f":"-N8+G8","v":0},{"$f":"-O8+G8","v":0},{"$f":"-P8+G8","v":0},null,"S1",{"$f":"IF(E47<=0,0,1-EXP((-(E47^2))/(2*$B47^2)))","v":0},{"$f":"IF(F47<=0,0,1-EXP((-(F47^2))/(2*$B47^2)))","v":0},{"$f":"IF(G47<=0,0,1-EXP((-(G47^2))/(2*$B47^2)))","v":0},{"$f":"IF(H47<=0,0,1-EXP((-(H47^2))/(2*$B47^2)))","v":0},{"$f":"IF(I47<=0,0,1-EXP((-(I47^2))/(2*$B47^2)))","v":0},{"$f":"IF(J47<=0,0,1-EXP((-(J47^2))/(2*$B47^2)))","v":0},{"$f":"IF(K47<=0,0,1-EXP((-(K47^2))/(2*$B47^2)))","v":0},{"$f":"IF(L47<=0,0,1-EXP((-(L47^2))/(2*$B47^2)))","v":0},{"$f":"IF(M47<=0,0,1-EXP((-(M47^2))/(2*$B47^2)))","v":0},{"$f":"IF(N47<=0,0,1-EXP((-(N47^2))/(2*$B47^2)))","v":0}]
[null,{"$f":"$C$94/2","v":0},null,"S2",{"$f":"-G8+H8","v":0},0,{"$f":"-I8+H8","v":0},{"$f":"-J8+H8","v":0},{"$f":"-K8+H8","v":0},{"$f":"-L8+H8","v":0},{"$f":"-M8+H8","v":0},{"$f":"-N8+H8","v":0},{"$f":"-O8+H8","v":0},{"$f":"-P8+H8","v":0},null,"S2",{"$f":"IF(E48<=0,0,1-EXP((-(E48^2))/(2*$B48^2)))","v":0},0,0,0,0,0,0,0,0,0]
[null,0,null,"S3",{"$f":"-G8+I8","v":0},{"$f":"-H8+I8","v":0},0,{"$f":"-J8+I8","v":0},{"$f":"-K8+I8","v":0},{"$f":"-L8+I8","v":0},{"$f":"-M8+I8","v":0},{"$f":"-N8+I8","v":0},{"$f":"-O8+I8","v":0},{"$f":"-P8+I8","v":0},null,"S3",0,0,0,0,0,0,0,0,0,0]
[null,0,null,"S4",{"$f":"-G8+J8","v":0},{"$f":"-H8+J8","v":0},{"$f":"-I8+J8","v":0},0,{"$f":"-K8+J8","v":0},{"$f":"-L8+J8","v":0},{"$f":"-M8+J8","v":0},{"$f":"-N8+J8","v":0},{"$f":"-O8+J8","v":0},{"$f":"-P8+J8","v":0},null,"S4",0,0,0,0,0,0,0,0,0,0]
[null,0,null,"S5",{"$f":"-G8+K8","v":0},{"$f":"-H8+K8","v":0},{"$f":"-I8+K8","v":0},{"$f":"-J8+K8","v":0},0,{"$f":"-L8+K8","v":0},{"$f":"-M8+K8","v":0},{"$f":"-N8+K8","v":0},{"$f":"-O8+K8","v":0},{"$f":"-P8+K8","v":0},null,"S5",0,0,0,0,0,0,0,0,0,0]
[null,0,null,"S6",{"$f":"-G8+L8","v":0},{"$f":"-H8+L8","v":0},{"$f":"-I8+L8","v":0},{"$f":"-J8+L8","v":0},{"$f":"-K8+L8","v":0},0,{"$f":"-M8+L8","v":0},{"$f":"-N8+L8","v":0},{"$f":"-O8+L8","v":0},{"$f":"-P8+L8","v":0},null,"S6",0,0,0,0,0,0,0,0,0,0]
[null,0,null,"S7",{"$f":"-G8+M8","v":0},{"$f":"-H8+M8","v":0},{"$f":"-I8+M8","v":0},{"$f":"-J8+M8","v":0},{"$f":"-K8+M8","v":0},{"$f":"-L8+M8","v":0},0,{"$f":"-N8+M8","v":0},{"$f":"-O8+M8","v":0},{"$f":"-P8+M8","v":0},null,"S7",0,0,0,0,0,0,0,0,0,0]
[null,0,null,"S8",{"$f":"-G8+N8","v":0},{"$f":"-H8+N8","v":0},{"$f":"-I8+N8","v":0},{"$f":"-J8+N8","v":0},{"$f":"-K8+N8","v":0},{"$f":"-L8+N8","v":0},{"$f":"-M8+N8","v":0},0,{"$f":"-O8+N8","v":0},{"$f":"-P8+N8","v":0},null,"S8",0,0,0,0,0,0,0,0,0,0]
[null,0,null,"S9",{"$f":"-G8+O8","v":0},{"$f":"-H8+O8","v":0},{"$f":"-I8+O8","v":0},{"$f":"-J8+O8","v":0},{"$f":"-K8+O8","v":0},{"$f":"-L8+O8","v":0},{"$f":"-M8+O8","v":0},{"$f":"-N8+O8","v":0},0,{"$f":"-P8+O8","v":0},null,"S9",0,0,0,0,0,0,0,0,0,0]
[null,0,null,"S10",{"$f":"-G8+P8","v":0},{"$f":"-H8+P8","v":0},{"$f":"-I8+P8","v":0},{"$f":"-J8+P8","v":0},{"$f":"-K8+P8","v":0},{"$f":"-L8+P8","v":0},{"$f":"-M8+P8","v":0},{"$f":"-N8+P8","v":0},{"$f":"-O8+P8","v":0},0,null,"S10",0,0,0,0,0,0,0,0,0,0]
[]
[]
[null,null,null,1,"Comparaison par paire dk(ai,bj)"]
[null,null,null,null,{"$f":"G4","v":""},"","","","","","","","",""]
[null,null,{"$f":"IF(E5=\"Min\",MIN(E61:N70)-MAX(E61:N70),MAX(E61:N70)-MIN(E61:N70))","v":0},{"$f":"G4","v":""},"x",{"$f":"IF(AND(F$60=\"\",$D61=\"\"),\"x\",IF($E$5=\"Min\",IF(F14<=0,F14,\"X\"), IF(F14>=0,\"X\",F14)))","v":"x"},"x","x","x","x","x","x","x","x"]
[null,null,null,{"$f":"H4","v":""},{"$f":"IF(AND(E$60=\"\",$D62=\"\"),\"x\",IF($E$5=\"Min\",IF(E15<=0,E15,\"X\"), IF(E15>=0,\"X\",E15)))","v":"x"},"x",{"$f":"IF(AND(G$60=\"\",$D62=\"\"),\"x\",IF($E$5=\"Min\",IF(G15<=0,G15,\"X\"), IF(G15>=0,\"X\",G15)))","v":"x"},"x","x","x","x","x","x","x"]
[null,null,null,{"$f":"I4","v":""},"x",{"$f":"IF(AND(F$60=\"\",$D63=\"\"),\"x\",IF($E$5=\"Min\",IF(F16<=0,F16,\"X\"), IF(F16>=0,\"X\",F16)))","v":"x"},"x",{"$f":"IF(AND(H$60=\"\",$D63=\"\"),\"x\",IF($E$5=\"Min\",IF(H16<=0,H16,\"X\"), IF(H16>=0,\"X\",H16)))","v":"x"},"x","x","x","x","x","x"]
[null,null,null,{"$f":"J4","v":""},"x","x",{"$f":"IF(AND(G$60=\"\",$D64=\"\"),\"x\",IF($E$5=\"Min\",IF(G17<=0,G17,\"X\"), IF(G17>=0,\"X\",G17)))","v":"x"},"x",{"$f":"IF(AND(I$60=\"\",$D64=\"\"),\"x\",IF($E$5=\"Min\",IF(I17<=0,I17,\"X\"), IF(I17>=0,\"X\",I17)))","v":"x"},"x","x","x","x","x"]
[null,null,null,{"$f":"K4","v":""},"x","x","x",{"$f":"IF(AND(H$60=\"\",$D65=\"\"),\"x\",IF($E$5=\"Min\",IF(H18<=0,H18,\"X\"), IF(H18>=0,\"X\",H18)))","v":"x"},"x",{"$f":"IF(AND(J$60=\"\",$D65=\"\"),\"x\",IF($E$5=\"Min\",IF(J18<=0,J18,\"X\"), IF(J18>=0,\"X\",J18)))","v":"x"},{"$f":"IF(AND(K$60=\"\",$D65=\"\"),\"x\",IF($E$5=\"Min\",IF(K18<=0,K18,\"X\"), IF(K18>=0,\"X\",K18)))","v":"x"},{"$f":"IF(AND(L$60=\"\",$D65=\"\"),\"x\",IF($E$5=\"Min\",IF(L18<=0,L18,\"X\"), IF(L18>=0,\"X\",L18)))","v":"x"},{"$f":"IF(AND(M$60=\"\",$D65=\"\"),\"x\",IF($E$5=\"Min\",IF(M18<=0,M18,\"X\"), IF(M18>=0,\"X\",M18)))","v":"x"},{"$f":"IF(AND(N$60=\"\",$D65=\"\"),\"x\",IF($E$5=\"Min\",IF(N18<=0,N18,\"X\"), IF(N18>=0,\"X\",N18)))","v":"x"}]
[null,null,null,{"$f":"L4","v":""},"x","x","x","x",{"$f":"IF(AND(I$60=\"\",$D66=\"\"),\"x\",IF($E$5=\"Min\",IF(I19<=0,I19,\"X\"), IF(I19>=0,\"X\",I19)))","v":"x"},"x",{"$f":"IF(AND(K$60=\"\",$D66=\"\"),\"x\",IF($E$5=\"Min\",IF(K19<=0,K19,\"X\"), IF(K19>=0,\"X\",K19)))","v":"x"},{"$f":"IF(AND(L$60=\"\",$D66=\"\"),\"x\",IF($E$5=\"Min\",IF(L19<=0,L19,\"X\"), IF(L19>=0,\"X\",L19)))","v":"x"},{"$f":"IF(AND(M$60=\"\",$D66=\"\"),\"x\",IF($E$5=\"Min\",IF(M19<=0,M19,\"X\"), IF(M19>=0,\"X\",M19)))","v":"x"},{"$f":"IF(AND(N$60=\"\",$D66=\"\"),\"x\",IF($E$5=\"Min\",IF(N19<=0,N19,\"X\"), IF(N19>=0,\"X\",N19)))","v":"x"}]
[null,null,null,{"$f":"M4","v":""},"x","x","x","x",{"$f":"IF(AND(I$60=\"\",$D67=\"\"),\"x\",IF($E$5=\"Min\",IF(I20<=0,I20,\"X\"), IF(I20>=0,\"X\",I20)))","v":"x"},{"$f":"IF(AND(J$60=\"\",$D67=\"\"),\"x\",IF($E$5=\"Min\",IF(J20<=0,J20,\"X\"), IF(J20>=0,\"X\",J20)))","v":"x"},"x",{"$f":"IF(AND(L$60=\"\",$D67=\"\"),\"x\",IF($E$5=\"Min\",IF(L20<=0,L20,\"X\"), IF(L20>=0,\"X\",L20)))","v":"x"},{"$f":"IF(AND(M$60=\"\",$D67=\"\"),\"x\",IF($E$5=\"Min\",IF(M20<=0,M20,\"X\"), IF(M20>=0,\"X\",M20)))","v":"x"},{"$f":"IF(AND(N$60=\"\",$D67=\"\"),\"x\",IF($E$5=\"Min\",IF(N20<=0,N20,\"X\"), IF(N20>=0,\"X\",N20)))","v":"x"}]
[null,null,null,{"$f":"N4","v":""},"x","x","x","x",{"$f":"IF(AND(I$60=\"\",$D68=\"\"),\"x\",IF($E$5=\"Min\",IF(I21<=0,I21,\"X\"), IF(I21>=0,\"X\",I21)))","v":"x"},{"$f":"IF(AND(J$60=\"\",$D68=\"\"),\"x\",IF($E$5=\"Min\",IF(J21<=0,J21,\"X\"), IF(J21>=0,\"X\",J21)))","v":"x"},{"$f":"IF(AND(K$60=\"\",$D68=\"\"),\"x\",IF($E$5=\"Min\",IF(K21<=0,K21,\"X\"), IF(K21>=0,\"X\",K21)))","v":"x"},"x",{"$f":"IF(AND(M$60=\"\",$D68=\"\"),\"x\",IF($E$5=\"Min\",IF(M21<=0,M21,\"X\"), IF(M21>=0,\"X\",M21)))","v":"x"},{"$f":"IF(AND(N$60=\"\",$D68=\"\"),\"x\",IF($E$5=\"Min\",IF(N21<=0,N21,\"X\"), IF(N21>=0,\"X\",N21)))","v":"x"}]
[null,null,null,{"$f":"O4","v":""},"x","x","x","x",{"$f":"IF(AND(I$60=\"\",$D69=\"\"),\"x\",IF($E$5=\"Min\",IF(I22<=0,I22,\"X\"), IF(I22>=0,\"X\",I22)))","v":"x"},{"$f":"IF(AND(J$60=\"\",$D69=\"\"),\"x\",IF($E$5=\"Min\",IF(J22<=0,J22,\"X\"), IF(J22>=0,\"X\",J22)))","v":"x"},{"$f":"IF(AND(K$60=\"\",$D69=\"\"),\"x\",IF($E$5=\"Min\",IF(K22<=0,K22,\"X\"), IF(K22>=0,\"X\",K22)))","v":"x"},{"$f":"IF(AND(L$60=\"\",$D69=\"\"),\"x\",IF($E$5=\"Min\",IF(L22<=0,L22,\"X\"), IF(L22>=0,\"X\",L22)))","v":"x"},"x",{"$f":"IF(AND(N$60=\"\",$D69=\"\"),\"x\",IF($E$5=\"Min\",IF(N22<=0,N22,\"X\"), IF(N22>=0,\"X\",N22)))","v":"x"}]
[null,null,null,{"$f":"P4","v":""},"x","x","x","x",{"$f":"IF(AND(I$60=\"\",$D70=\"\"),\"x\",IF($E$5=\"Min\",IF(I23<=0,I23,\"X\"), IF(I23>=0,\"X\",I23)))","v":"x"},{"$f":"IF(AND(J$60=\"\",$D70=\"\"),\"x\",IF($E$5=\"Min\",IF(J23<=0,J23,\"X\"), IF(J23>=0,\"X\",J23)))","v":"x"},{"$f":"IF(AND(K$60=\"\",$D70=\"\"),\"x\",IF($E$5=\"Min\",IF(K23<=0,K23,\"X\"), IF(K23>=0,\"X\",K23)))","v":"x"},{"$f":"IF(AND(L$60=\"\",$D70=\"\"),\"x\",IF($E$5=\"Min\",IF(L23<=0,L23,\"X\"), IF(L23>=0,\"X\",L23)))","v":"x"},{"$f":"IF(AND(M$60=\"\",$D70=\"\"),\"x\",IF($E$5=\"Min\",IF(M23<=0,M23,\"X\"), IF(M23>=0,\"X\",M23)))","v":"x"},"x"]
[]
[null,null,{"$f":"IF(E6=\"Min\",MIN(E72:N81)-MAX(E72:N81),MAX(E72:N81)-MIN(E72:N81))","v":0},{"$f":"G4","v":""},"x",{"$f":"IF(AND(F$60=\"\",$D72=\"\"),\"x\",IF($E$6=\"Min\",IF(F25<=0,F25,\"X\"), IF(F25>=0,\"X\",F25)))","v":"x"},"x","x","x","x","x","x","x","x"]
[null,null,null,{"$f":"H4","v":""},{"$f":"IF(AND(E$60=\"\",$D73=\"\"),\"x\",IF($E$6=\"Min\",IF(E26<=0,E26,\"X\"), IF(E26>=0,\"X\",E26)))","v":"x"},"x",{"$f":"IF(AND(G$60=\"\",$D73=\"\"),\"x\",IF($E$6=\"Min\",IF(G26<=0,G26,\"X\"), IF(G26>=0,\"X\",G26)))","v":"x"},"x","x","x","x","x","x","x"]
[null,null,null,{"$f":"I4","v":""},"x",{"$f":"IF(AND(F$60=\"\",$D74=\"\"),\"x\",IF($E$6=\"Min\",IF(F27<=0,F27,\"X\"), IF(F27>=0,\"X\",F27)))","v":"x"},"x",{"$f":"IF(AND(H$60=\"\",$D74=\"\"),\"x\",IF($E$6=\"Min\",IF(H27<=0,H27,\"X\"), IF(H27>=0,\"X\",H27)))","v":"x"},"x","x","x","x","x","x"]
[null,null,null,{"$f":"J4","v":""},"x","x",{"$f":"IF(AND(G$60=\"\",$D75=\"\"),\"x\",IF($E$6=\"Min\",IF(G28<=0,G28,\"X\"), IF(G28>=0,\"X\",G28)))","v":"x"},"x",{"$f":"IF(AND(I$60=\"\",$D75=\"\"),\"x\",IF($E$6=\"Min\",IF(I28<=0,I28,\"X\"), IF(I28>=0,\"X\",I28)))","v":"x"},"x","x","x","x","x"]
[null,null,null,{"$f":"K4","v":""},"x","x","x",{"$f":"IF(AND(H$60=\"\",$D76=\"\"),\"x\",IF($E$6=\"Min\",IF(H29<=0,H29,\"X\"), IF(H29>=0,\"X\",H29)))","v":"x"},"x",{"$f":"IF(AND(J$60=\"\",$D76=\"\"),\"x\",IF($E$6=\"Min\",IF(J29<=0,J29,\"X\"), IF(J29>=0,\"X\",J29)))","v":"x"},{"$f":"IF(AND(K$60=\"\",$D76=\"\"),\"x\",IF($E$6=\"Min\",IF(K29<=0,K29,\"X\"), IF(K29>=0,\"X\",K29)))","v":"x"},{"$f":"IF(AND(L$60=\"\",$D76=\"\"),\"x\",IF($E$6=\"Min\",IF(L29<=0,L29,\"X\"), IF(L29>=0,\"X\",L29)))","v":"x"},{"$f":"IF(AND(M$60=\"\",$D76=\"\"),\"x\",IF($E$6=\"Min\",IF(M29<=0,M29,\"X\"), IF(M29>=0,\"X\",M29)))","v":"x"},{"$f":"IF(AND(N$60=\"\",$D76=\"\"),\"x\",IF($E$6=\"Min\",IF(N29<=0,N29,\"X\"), IF(N29>=0,\"X\",N29)))","v":"x"}]
[null,null,null,{"$f":"L4","v":""},"x","x","x","x",{"$f":"IF(AND(I$60=\"\",$D77=\"\"),\"x\",IF($E$6=\"Min\",IF(I30<=0,I30,\"X\"), IF(I30>=0,\"X\",I30)))","v":"x"},"x",{"$f":"IF(AND(K$60=\"\",$D77=\"\"),\"x\",IF($E$6=\"Min\",IF(K30<=0,K30,\"X\"), IF(K30>=0,\"X\",K30)))","v":"x"},{"$f":"IF(AND(L$60=\"\",$D77=\"\"),\"x\",IF($E$6=\"Min\",IF(L30<=0,L30,\"X\"), IF(L30>=0,\"X\",L30)))","v":"x"},{"$f":"IF(AND(M$60=\"\",$D77=\"\"),\"x\",IF($E$6=\"Min\",IF(M30<=0,M30,\"X\"), IF(M30>=0,\"X\",M30)))","v":"x"},{"$f":"IF(AND(N$60=\"\",$D77=\"\"),\"x\",IF($E$6=\"Min\",IF(N30<=0,N30,\"X\"), IF(N30>=0,\"X\",N30)))","v":"x"}]
[null,null,null,{"$f":"M4","v":""},"x","x","x","x",{"$f":"IF(AND(I$60=\"\",$D78=\"\"),\"x\",IF($E$6=\"Min\",IF(I31<=0,I31,\"X\"), IF(I31>=0,\"X\",I31)))","v":"x"},{"$f":"IF(AND(J$60=\"\",$D78=\"\"),\"x\",IF($E$6=\"Min\",IF(J31<=0,J31,\"X\"), IF(J31>=0,\"X\",J31)))","v":"x"},"x",{"$f":"IF(AND(L$60=\"\",$D78=\"\"),\"x\",IF($E$6=\"Min\",IF(L31<=0,L31,\"X\"), IF(L31>=0,\"X\",L31)))","v":"x"},{"$f":"IF(AND(M$60=\"\",$D78=\"\"),\"x\",IF($E$6=\"Min\",IF(M31<=0,M31,\"X\"), IF(M31>=0,\"X\",M31)))","v":"x"},{"$f":"IF(AND(N$60=\"\",$D78=\"\"),\"x\",IF($E$6=\"Min\",IF(N31<=0,N31,\"X\"), IF(N31>=0,\"X\",N31)))","v":"x"}]
[null,null,null,{"$f":"N4","v":""},"x","x","x","x",{"$f":"IF(AND(I$60=\"\",$D79=\"\"),\"x\",IF($E$6=\"Min\",IF(I32<=0,I32,\"X\"), IF(I32>=0,\"X\",I32)))","v":"x"},{"$f":"IF(AND(J$60=\"\",$D79=\"\"),\"x\",IF($E$6=\"Min\",IF(J32<=0,J32,\"X\"), IF(J32>=0,\"X\",J32)))","v":"x"},{"$f":"IF(AND(K$60=\"\",$D79=\"\"),\"x\",IF($E$6=\"Min\",IF(K32<=0,K32,\"X\"), IF(K32>=0,\"X\",K32)))","v":"x"},"x",{"$f":"IF(AND(M$60=\"\",$D79=\"\"),\"x\",IF($E$6=\"Min\",IF(M32<=0,M32,\"X\"), IF(M32>=0,\"X\",M32)))","v":"x"},{"$f":"IF(AND(N$60=\"\",$D79=\"\"),\"x\",IF($E$6=\"Min\",IF(N32<=0,N32,\"X\"), IF(N32>=0,\"X\",N32)))","v":"x"}]
[null,null,null,{"$f":"O4","v":""},"x","x","x","x",{"$f":"IF(AND(I$60=\"\",$D80=\"\"),\"x\",IF($E$6=\"Min\",IF(I33<=0,I33,\"X\"), IF(I33>=0,\"X\",I33)))","v":"x"},{"$f":"IF(AND(J$60=\"\",$D80=\"\"),\"x\",IF($E$6=\"Min\",IF(J33<=0,J33,\"X\"), IF(J33>=0,\"X\",J33)))","v":"x"},{"$f":"IF(AND(K$60=\"\",$D80=\"\"),\"x\",IF($E$6=\"Min\",IF(K33<=0,K33,\"X\"), IF(K33>=0,\"X\",K33)))","v":"x"},{"$f":"IF(AND(L$60=\"\",$D80=\"\"),\"x\",IF($E$6=\"Min\",IF(L33<=0,L33,\"X\"), IF(L33>=0,\"X\",L33)))","v":"x"},"x",{"$f":"IF(AND(N$60=\"\",$D80=\"\"),\"x\",IF($E$6=\"Min\",IF(N33<=0,N33,\"X\"), IF(N33>=0,\"X\",N33)))","v":"x"}]
[null,null,null,{"$f":"P4","v":""},"x","x","x","x",{"$f":"IF(AND(I$60=\"\",$D81=\"\"),\"x\",IF($E$6=\"Min\",IF(I34<=0,I34,\"X\"), IF(I34>=0,\"X\",I34)))","v":"x"},{"$f":"IF(AND(J$60=\"\",$D81=\"\"),\"x\",IF($E$6=\"Min\",IF(J34<=0,J34,\"X\"), IF(J34>=0,\"X\",J34)))","v":"x"},{"$f":"IF(AND(K$60=\"\",$D81=\"\"),\"x\",IF($E$6=\"Min\",IF(K34<=0,K34,\"X\"), IF(K34>=0,\"X\",K34)))","v":"x"},{"$f":"IF(AND(L$60=\"\",$D81=\"\"),\"x\",IF($E$6=\"Min\",IF(L34<=0,L34,\"X\"), IF(L34>=0,\"X\",L34)))","v":"x"},{"$f":"IF(AND(M$60=\"\",$D81=\"\"),\"x\",IF($E$6=\"Min\",IF(M34<=0,M34,\"X\"), IF(M34>=0,\"X\",M34)))","v":"x"},"x"]
[]
[null,null,{"$f":"IF(E7=\"Min\",MIN(E83:N92)-MAX(E83:N92),MAX(E83:N92)-MIN(E83:N92))","v":0},{"$f":"G4","v":""},"x",{"$f":"IF(AND(F$60=\"\",$D83=\"\"),\"x\",IF($E$7=\"Min\",IF(F36<=0,F36,\"X\"), IF(F36>=0,\"X\",F36)))","v":"x"},"x","x","x","x","x","x","x","x"]
[null,null,null,{"$f":"H4","v":""},{"$f":"IF(AND(E$60=\"\",$D84=\"\"),\"x\",IF($E$7=\"Min\",IF(E37<=0,E37,\"X\"), IF(E37>=0,\"X\",E37)))","v":"x"},"x",{"$f":"IF(AND(G$60=\"\",$D84=\"\"),\"x\",IF($E$7=\"Min\",IF(G37<=0,G37,\"X\"), IF(G37>=0,\"X\",G37)))","v":"x"},"x","x","x","x","x","x","x"]
[null,null,null,{"$f":"I4","v":""},"x",{"$f":"IF(AND(F$60=\"\",$D85=\"\"),\"x\",IF($E$7=\"Min\",IF(F38<=0,F38,\"X\"), IF(F38>=0,\"X\",F38)))","v":"x"},"x",{"$f":"IF(AND(H$60=\"\",$D85=\"\"),\"x\",IF($E$7=\"Min\",IF(H38<=0,H38,\"X\"), IF(H38>=0,\"X\",H38)))","v":"x"},"x","x","x","x","x","x"]
[null,null,null,{"$f":"J4","v":""},"x","x",{"$f":"IF(AND(G$60=\"\",$D86=\"\"),\"x\",IF($E$7=\"Min\",IF(G39<=0,G39,\"X\"), IF(G39>=0,\"X\",G39)))","v":"x"},"x",{"$f":"IF(AND(I$60=\"\",$D86=\"\"),\"x\",IF($E$7=\"Min\",IF(I39<=0,I39,\"X\"), IF(I39>=0,\"X\",I39)))","v":"x"},"x","x","x","x","x"]
[null,null,null,{"$f":"K4","v":""},"x","x","x",{"$f":"IF(AND(H$60=\"\",$D87=\"\"),\"x\",IF($E$7=\"Min\",IF(H40<=0,H40,\"X\"), IF(H40>=0,\"X\",H40)))","v":"x"},"x",{"$f":"IF(AND(J$60=\"\",$D87=\"\"),\"x\",IF($E$7=\"Min\",IF(J40<=0,J40,\"X\"), IF(J40>=0,\"X\",J40)))","v":"x"},{"$f":"IF(AND(K$60=\"\",$D87=\"\"),\"x\",IF($E$7=\"Min\",IF(K40<=0,K40,\"X\"), IF(K40>=0,\"X\",K40)))","v":"x"},{"$f":"IF(AND(L$60=\"\",$D87=\"\"),\"x\",IF($E$7=\"Min\",IF(L40<=0,L40,\"X\"), IF(L40>=0,\"X\",L40)))","v":"x"},{"$f":"IF(AND(M$60=\"\",$D87=\"\"),\"x\",IF($E$7=\"Min\",IF(M40<=0,M40,\"X\"), IF(M40>=0,\"X\",M40)))","v":"x"},{"$f":"IF(AND(N$60=\"\",$D87=\"\"),\"x\",IF($E$7=\"Min\",IF(N40<=0,N40,\"X\"), IF(N40>=0,\"X\",N40)))","v":"x"}]
[null,null,null,{"$f":"L4","v":""},"x","x","x","x",{"$f":"IF(AND(I$60=\"\",$D88=\"\"),\"x\",IF($E$7=\"Min\",IF(I41<=0,I41,\"X\"), IF(I41>=0,\"X\",I41)))","v":"x"},"x",{"$f":"IF(AND(K$60=\"\",$D88=\"\"),\"x\",IF($E$7=\"Min\",IF(K41<=0,K41,\"X\"), IF(K41>=0,\"X\",K41)))","v":"x"},{"$f":"IF(AND(L$60=\"\",$D88=\"\"),\"x\",IF($E$7=\"Min\",IF(L41<=0,L41,\"X\"), IF(L41>=0,\"X\",L41)))","v":"x"},{"$f":"IF(AND(M$60=\"\",$D88=\"\"),\"x\",IF($E$7=\"Min\",IF(M41<=0,M41,\"X\"), IF(M41>=0,\"X\",M41)))","v":"x"},{"$f":"IF(AND(N$60=\"\",$D88=\"\"),\"x\",IF($E$7=\"Min\",IF(N41<=0,N41,\"X\"), IF(N41>=0,\"X\",N41)))","v":"x"}]
[null,null,null,{"$f":"M4","v":""},"x","x","x","x",{"$f":"IF(AND(I$60=\"\",$D89=\"\"),\"x\",IF($E$7=\"Min\",IF(I42<=0,I42,\"X\"), IF(I42>=0,\"X\",I42)))","v":"x"},{"$f":"IF(AND(J$60=\"\",$D89=\"\"),\"x\",IF($E$7=\"Min\",IF(J42<=0,J42,\"X\"), IF(J42>=0,\"X\",J42)))","v":"x"},"x",{"$f":"IF(AND(L$60=\"\",$D89=\"\"),\"x\",IF($E$7=\"Min\",IF(L42<=0,L42,\"X\"), IF(L42>=0,\"X\",L42)))","v":"x"},{"$f":"IF(AND(M$60=\"\",$D89=\"\"),\"x\",IF($E$7=\"Min\",IF(M42<=0,M42,\"X\"), IF(M42>=0,\"X\",M42)))","v":"x"},{"$f":"IF(AND(N$60=\"\",$D89=\"\"),\"x\",IF($E$7=\"Min\",IF(N42<=0,N42,\"X\"), IF(N42>=0,\"X\",N42)))","v":"x"}]
[null,null,null,{"$f":"N4","v":""},"x","x","x","x",{"$f":"IF(AND(I$60=\"\",$D90=\"\"),\"x\",IF($E$7=\"Min\",IF(I43<=0,I43,\"X\"), IF(I43>=0,\"X\",I43)))","v":"x"},{"$f":"IF(AND(J$60=\"\",$D90=\"\"),\"x\",IF($E$7=\"Min\",IF(J43<=0,J43,\"X\"), IF(J43>=0,\"X\",J43)))","v":"x"},{"$f":"IF(AND(K$60=\"\",$D90=\"\"),\"x\",IF($E$7=\"Min\",IF(K43<=0,K43,\"X\"), IF(K43>=0,\"X\",K43)))","v":"x"},"x",{"$f":"IF(AND(M$60=\"\",$D90=\"\"),\"x\",IF($E$7=\"Min\",IF(M43<=0,M43,\"X\"), IF(M43>=0,\"X\",M43)))","v":"x"},{"$f":"IF(AND(N$60=\"\",$D90=\"\"),\"x\",IF($E$7=\"Min\",IF(N43<=0,N43,\"X\"), IF(N43>=0,\"X\",N43)))","v":"x"}]
[null,null,null,{"$f":"O4","v":""},"x","x","x","x",{"$f":"IF(AND(I$60=\"\",$D91=\"\"),\"x\",IF($E$7=\"Min\",IF(I44<=0,I44,\"X\"), IF(I44>=0,\"X\",I44)))","v":"x"},{"$f":"IF(AND(J$60=\"\",$D91=\"\"),\"x\",IF($E$7=\"Min\",IF(J44<=0,J44,\"X\"), IF(J44>=0,\"X\",J44)))","v":"x"},{"$f":"IF(AND(K$60=\"\",$D91=\"\"),\"x\",IF($E$7=\"Min\",IF(K44<=0,K44,\"X\"), IF(K44>=0,\"X\",K44)))","v":"x"},{"$f":"IF(AND(L$60=\"\",$D91=\"\"),\"x\",IF($E$7=\"Min\",IF(L44<=0,L44,\"X\"), IF(L44>=0,\"X\",L44)))","v":"x"},"x",{"$f":"IF(AND(N$60=\"\",$D91=\"\"),\"x\",IF($E$7=\"Min\",IF(N44<=0,N44,\"X\"), IF(N44>=0,\"X\",N44)))","v":"x"}]
[null,null,null,{"$f":"P4","v":""},"x","x","x","x",{"$f":"IF(AND(I$60=\"\",$D92=\"\"),\"x\",IF($E$7=\"Min\",IF(I45<=0,I45,\"X\"), IF(I45>=0,\"X\",I45)))","v":"x"},{"$f":"IF(AND(J$60=\"\",$D92=\"\"),\"x\",IF($E$7=\"Min\",IF(J45<=0,J45,\"X\"), IF(J45>=0,\"X\",J45)))","v":"x"},{"$f":"IF(AND(K$60=\"\",$D92=\"\"),\"x\",IF($E$7=\"Min\",IF(K45<=0,K45,\"X\"), IF(K45>=0,\"X\",K45)))","v":"x"},{"$f":"IF(AND(L$60=\"\",$D92=\"\"),\"x\",IF($E$7=\"Min\",IF(L45<=0,L45,\"X\"), IF(L45>=0,\"X\",L45)))","v":"x"},{"$f":"IF(AND(M$60=\"\",$D92=\"\"),\"x\",IF($E$7=\"Min\",IF(M45<=0,M45,\"X\"), IF(M45>=0,\"X\",M45)))","v":"x"},"x"]
[]
[null,null,{"$f":"IF(E8=\"Min\",MIN(E94:N103)-MAX(E94:N103),MAX(E94:N103)-MIN(E94:N103))","v":0},{"$f":"G4","v":""},"x",{"$f":"IF(AND(F$60=\"\",$D94=\"\"),\"x\",IF($E$8=\"Min\",IF(F47<=0,F47,\"X\"), IF(F47>=0,\"X\",F47)))","v":"x"},"x","x","x","x","x","x","x","x"]
[null,null,null,{"$f":"H4","v":""},{"$f":"IF(AND(E$60=\"\",$D95=\"\"),\"x\",IF($E$8=\"Min\",IF(E48<=0,E48,\"X\"), IF(E48>=0,\"X\",E48)))","v":"x"},"x",{"$f":"IF(AND(G$60=\"\",$D95=\"\"),\"x\",IF($E$8=\"Min\",IF(G48<=0,G48,\"X\"), IF(G48>=0,\"X\",G48)))","v":"x"},"x","x","x","x","x","x","x"]
[null,null,null,{"$f":"I4","v":""},"x",{"$f":"IF(AND(F$60=\"\",$D96=\"\"),\"x\",IF($E$8=\"Min\",IF(F49<=0,F49,\"X\"), IF(F49>=0,\"X\",F49)))","v":"x"},"x",{"$f":"IF(AND(H$60=\"\",$D96=\"\"),\"x\",IF($E$8=\"Min\",IF(H49<=0,H49,\"X\"), IF(H49>=0,\"X\",H49)))","v":"x"},"x","x","x","x","x","x"]
[null,null,null,{"$f":"J4","v":""},"x","x",{"$f":"IF(AND(G$60=\"\",$D97=\"\"),\"x\",IF($E$8=\"Min\",IF(G50<=0,G50,\"X\"), IF(G50>=0,\"X\",G50)))","v":"x"},"x",{"$f":"IF(AND(I$60=\"\",$D97=\"\"),\"x\",IF($E$8=\"Min\",IF(I50<=0,I50,\"X\"), IF(I50>=0,\"X\",I50)))","v":"x"},"x","x","x","x","x"]
[null,null,null,{"$f":"K4","v":""},"x","x","x",{"$f":"IF(AND(H$60=\"\",$D98=\"\"),\"x\",IF($E$8=\"Min\",IF(H51<=0,H51,\"X\"), IF(H51>=0,\"X\",H51)))","v":"x"},"x",{"$f":"IF(AND(J$60=\"\",$D98=\"\"),\"x\",IF($E$8=\"Min\",IF(J51<=0,J51,\"X\"), IF(J51>=0,\"X\",J51)))","v":"x"},{"$f":"IF(AND(K$60=\"\",$D98=\"\"),\"x\",IF($E$8=\"Min\",IF(K51<=0,K51,\"X\"), IF(K51>=0,\"X\",K51)))","v":"x"},{"$f":"IF(AND(L$60=\"\",$D98=\"\"),\"x\",IF($E$8=\"Min\",IF(L51<=0,L51,\"X\"), IF(L51>=0,\"X\",L51)))","v":"x"},{"$f":"IF(AND(M$60=\"\",$D98=\"\"),\"x\",IF($E$8=\"Min\",IF(M51<=0,M51,\"X\"), IF(M51>=0,\"X\",M51)))","v":"x"},{"$f":"IF(AND(N$60=\"\",$D98=\"\"),\"x\",IF($E$8=\"Min\",IF(N51<=0,N51,\"X\"), IF(N51>=0,\"X\",N51)))","v":"x"}]
[null,null,null,{"$f":"L4","v":""},"x","x","x","x",{"$f":"IF(AND(I$60=\"\",$D99=\"\"),\"x\",IF($E$8=\"Min\",IF(I52<=0,I52,\"X\"), IF(I52>=0,\"X\",I52)))","v":"x"},"x",{"$f":"IF(AND(K$60=\"\",$D99=\"\"),\"x\",IF($E$8=\"Min\",IF(K52<=0,K52,\"X\"), IF(K52>=0,\"X\",K52)))","v":"x"},{"$f":"IF(AND(L$60=\"\",$D99=\"\"),\"x\",IF($E$8=\"Min\",IF(L52<=0,L52,\"X\"), IF(L52>=0,\"X\",L52)))","v":"x"},{"$f":"IF(AND(M$60=\"\",$D99=\"\"),\"x\",IF($E$8=\"Min\",IF(M52<=0,M52,\"X\"), IF(M52>=0,\"X\",M52)))","v":"x"},{"$f":"IF(AND(N$60=\"\",$D99=\"\"),\"x\",IF($E$8=\"Min\",IF(N52<=0,N52,\"X\"), IF(N52>=0,\"X\",N52)))","v":"x"}]
[null,null,null,{"$f":"M4","v":""},"x","x","x","x",{"$f":"IF(AND(I$60=\"\",$D100=\"\"),\"x\",IF($E$8=\"Min\",IF(I53<=0,I53,\"X\"), IF(I53>=0,\"X\",I53)))","v":"x"},{"$f":"IF(AND(J$60=\"\",$D100=\"\"),\"x\",IF($E$8=\"Min\",IF(J53<=0,J53,\"X\"), IF(J53>=0,\"X\",J53)))","v":"x"},"x",{"$f":"IF(AND(L$60=\"\",$D100=\"\"),\"x\",IF($E$8=\"Min\",IF(L53<=0,L53,\"X\"), IF(L53>=0,\"X\",L53)))","v":"x"},{"$f":"IF(AND(M$60=\"\",$D100=\"\"),\"x\",IF($E$8=\"Min\",IF(M53<=0,M53,\"X\"), IF(M53>=0,\"X\",M53)))","v":"x"},{"$f":"IF(AND(N$60=\"\",$D100=\"\"),\"x\",IF($E$8=\"Min\",IF(N53<=0,N53,\"X\"), IF(N53>=0,\"X\",N53)))","v":"x"}]
[null,null,null,{"$f":"N4","v":""},"x","x","x","x",{"$f":"IF(AND(I$60=\"\",$D101=\"\"),\"x\",IF($E$8=\"Min\",IF(I54<=0,I54,\"X\"), IF(I54>=0,\"X\",I54)))","v":"x"},{"$f":"IF(AND(J$60=\"\",$D101=\"\"),\"x\",IF($E$8=\"Min\",IF(J54<=0,J54,\"X\"), IF(J54>=0,\"X\",J54)))","v":"x"},{"$f":"IF(AND(K$60=\"\",$D101=\"\"),\"x\",IF($E$8=\"Min\",IF(K54<=0,K54,\"X\"), IF(K54>=0,\"X\",K54)))","v":"x"},"x",{"$f":"IF(AND(M$60=\"\",$D101=\"\"),\"x\",IF($E$8=\"Min\",IF(M54<=0,M54,\"X\"), IF(M54>=0,\"X\",M54)))","v":"x"},{"$f":"IF(AND(N$60=\"\",$D101=\"\"),\"x\",IF($E$8=\"Min\",IF(N54<=0,N54,\"X\"), IF(N54>=0,\"X\",N54)))","v":"x"}]
[null,null,null,{"$f":"O4","v":""},"x","x","x","x",{"$f":"IF(AND(I$60=\"\",$D102=\"\"),\"x\",IF($E$8=\"Min\",IF(I55<=0,I55,\"X\"), IF(I55>=0,\"X\",I55)))","v":"x"},{"$f":"IF(AND(J$60=\"\",$D102=\"\"),\"x\",IF($E$8=\"Min\",IF(J55<=0,J55,\"X\"), IF(J55>=0,\"X\",J55)))","v":"x"},{"$f":"IF(AND(K$60=\"\",$D102=\"\"),\"x\",IF($E$8=\"Min\",IF(K55<=0,K55,\"X\"), IF(K55>=0,\"X\",K55)))","v":"x"},{"$f":"IF(AND(L$60=\"\",$D102=\"\"),\"x\",IF($E$8=\"Min\",IF(L55<=0,L55,\"X\"), IF(L55>=0,\"X\",L55)))","v":"x"},"x",{"$f":"IF(AND(N$60=\"\",$D102=\"\"),\"x\",IF($E$8=\"Min\",IF(N55<=0,N55,\"X\"), IF(N55>=0,\"X\",N55)))","v":"x"}]
[null,null,null,{"$f":"P4","v":""},"x","x","x","x",{"$f":"IF(AND(I$60=\"\",$D103=\"\"),\"x\",IF($E$8=\"Min\",IF(I56<=0,I56,\"X\"), IF(I56>=0,\"X\",I56)))","v":"x"},{"$f":"IF(AND(J$60=\"\",$D103=\"\"),\"x\",IF($E$8=\"Min\",IF(J56<=0,J56,\"X\"), IF(J56>=0,\"X\",J56)))","v":"x"},{"$f":"IF(AND(K$60=\"\",$D103=\"\"),\"x\",IF($E$8=\"Min\",IF(K56<=0,K56,\"X\"), IF(K56>=0,\"X\",K56)))","v":"x"},{"$f":"IF(AND(L$60=\"\",$D103=\"\"),\"x\",IF($E$8=\"Min\",IF(L56<=0,L56,\"X\"), IF(L56>=0,\"X\",L56)))","v":"x"},{"$f":"IF(AND(M$60=\"\",$D103=\"\"),\"x\",IF($E$8=\"Min\",IF(M56<=0,M56,\"X\"), IF(M56>=0,\"X\",M56)))","v":"x"},"x"]

{"sheet":"Envi-Loc","index":19,"n_rows":83,"n_cols":43,"rows_kept":83,"cut":false,"hidden":true,"merged":[[73,2,82,2],[34,2,43,2],[48,4,48,13],[50,2,59,2],[61,2,70,2],[22,2,31,2],[1,2,1,38],[9,4,9,13],[9,16,9,25],[9,28,9,37],[11,2,20,2]]}
[]
[null,null,"ENVIRONNEMENT - LOCAL"]
[null,null,null,null,null,null,{"$f":"IF(G4=\"\",0,1)","v":0},0,0,0,0,0,0,0,0,0,{"$f":"SUM(G3:P3)","v":0}]
[null,{"$f":"SUM(B5:B7)","v":1},null,null,null,null,{"$f":"IF(DonnéesFinales!H$19=\"n/a\",\"\",\"T1\")","v":""},{"$f":"IF(DonnéesFinales!I$19=\"n/a\",\"\",\"T2\")","v":""},{"$f":"IF(DonnéesFinales!J$19=\"n/a\",\"\",\"T3\")","v":""},{"$f":"IF(DonnéesFinales!K$19=\"n/a\",\"\",\"T4\")","v":""},{"$f":"IF(DonnéesFinales!L$19=\"n/a\",\"\",\"T5\")","v":""},{"$f":"IF(DonnéesFinales!M$19=\"n/a\",\"\",\"T6\")","v":""},{"$f":"IF(DonnéesFinales!N$19=\"n/a\",\"\",\"T7\")","v":""},{"$f":"IF(DonnéesFinales!O$19=\"n/a\",\"\",\"T8\")","v":""},{"$f":"IF(DonnéesFinales!P$19=\"n/a\",\"\",\"T9\")","v":""},{"$f":"IF(DonnéesFinales!Q$19=\"n/a\",\"\",\"T10\")","v":""},null,true,false]
[null,{"$f":"IF(Q5=TRUE,1,0)","v":1},{"$f":"DonnéesFinales!D27","v":"Pourcentage de charge polluante éliminé"},{"$f":"R5+IF(Q5=TRUE,$S$8/$B$4,0%)","v":0.60000000000000009},{"$f":"DonnéesFinales!F27","v":"Min"},{"$f":"DonnéesFinales!G27","v":"Unité"},{"$f":"IF(OR(DonnéesFinales!$R27=FALSE,G$4=\"\"),0,DonnéesFinales!H27)","v":0},{"$f":"IF(OR(DonnéesFinales!$R27=FALSE,H$4=\"\"),0,DonnéesFinales!I27)","v":0},{"$f":"IF(OR(DonnéesFinales!$R27=FALSE,I$4=\"\"),0,DonnéesFinales!J27)","v":0},{"$f":"IF(OR(DonnéesFinales!$R27=FALSE,J$4=\"\"),0,DonnéesFinales!K27)","v":0},{"$f":"IF(OR(DonnéesFinales!$R27=FALSE,K$4=\"\"),0,DonnéesFinales!L27)","v":0},{"$f":"IF(OR(DonnéesFinales!$R27=FALSE,L$4=\"\"),0,DonnéesFinales!M27)","v":0},{"$f":"IF(OR(DonnéesFinales!$R27=FALSE,M$4=\"\"),0,DonnéesFinales!N27)","v":0},{"$f":"IF(OR(DonnéesFinales!$R27=FALSE,N$4=\"\"),0,DonnéesFinales!O27)","v":0},{"$f":"IF(OR(DonnéesFinales!$R27=FALSE,O$4=\"\"),0,DonnéesFinales!P27)","v":0},{"$f":"IF(OR(DonnéesFinales!$R27=FALSE,P$4=\"\"),0,DonnéesFinales!Q27)","v":0},{"$f":"DonnéesFinales!$R27","v":true},{"$f":"IF(Q5=TRUE,40%,0)","v":0.4},{"$f":"IF(Q5=FALSE,40%,0)","v":0}]
[null,{"$f":"IF(Q6=TRUE,1,0)","v":0},{"$f":"DonnéesFinales!D28","v":"Impact des actes et travaux sur les écosystèmes"},{"$f":"R6+IF(Q6=TRUE,$S$8/$B$4,0%)","v":0},{"$f":"DonnéesFinales!F28","v":"Min"},{"$f":"DonnéesFinales!G28","v":"Unité"},{"$f":"IF(OR(DonnéesFinales!$R28=FALSE,G$4=\"\"),0,DonnéesFinales!H28)","v":0},{"$f":"IF(OR(DonnéesFinales!$R28=FALSE,H$4=\"\"),0,DonnéesFinales!I28)","v":0},{"$f":"IF(OR(DonnéesFinales!$R28=FALSE,I$4=\"\"),0,DonnéesFinales!J28)","v":0},{"$f":"IF(OR(DonnéesFinales!$R28=FALSE,J$4=\"\"),0,DonnéesFinales!K28)","v":0},{"$f":"IF(OR(DonnéesFinales!$R28=FALSE,K$4=\"\"),0,DonnéesFinales!L28)","v":0},{"$f":"IF(OR(DonnéesFinales!$R28=FALSE,L$4=\"\"),0,DonnéesFinales!M28)","v":0},{"$f":"IF(OR(DonnéesFinales!$R28=FALSE,M$4=\"\"),0,DonnéesFinales!N28)","v":0},{"$f":"IF(OR(DonnéesFinales!$R28=FALSE,N$4=\"\"),0,DonnéesFinales!O28)","v":0},{"$f":"IF(OR(DonnéesFinales!$R28=FALSE,O$4=\"\"),0,DonnéesFinales!P28)","v":0},{"$f":"IF(OR(DonnéesFinales!$R28=FALSE,P$4=\"\"),0,DonnéesFinales!Q28)","v":0},{"$f":"DonnéesFinales!$R28","v":false},{"$f":"IF(Q6=TRUE,20%,0)","v":0},{"$f":"IF(Q6=FALSE,20%,0)","v":0.2}]
[null,0,{"$f":"DonnéesFinales!D29","v":"Risque de mobilisation du polluant (vers eau ou air)."},0,{"$f":"DonnéesFinales!F29","v":"Min"},{"$f":"DonnéesFinales!G29","v":"Unité"},{"$f":"IF(OR(DonnéesFinales!$R29=FALSE,G$4=\"\"),0,DonnéesFinales!H29)","v":0},{"$f":"IF(OR(DonnéesFinales!$R29=FALSE,H$4=\"\"),0,DonnéesFinales!I29)","v":0},{"$f":"IF(OR(DonnéesFinales!$R29=FALSE,I$4=\"\"),0,DonnéesFinales!J29)","v":0},{"$f":"IF(OR(DonnéesFinales!$R29=FALSE,J$4=\"\"),0,DonnéesFinales!K29)","v":0},{"$f":"IF(OR(DonnéesFinales!$R29=FALSE,K$4=\"\"),0,DonnéesFinales!L29)","v":0},{"$f":"IF(OR(DonnéesFinales!$R29=FALSE,L$4=\"\"),0,DonnéesFinales!M29)","v":0},{"$f":"IF(OR(DonnéesFinales!$R29=FALSE,M$4=\"\"),0,DonnéesFinales!N29)","v":0},{"$f":"IF(OR(DonnéesFinales!$R29=FALSE,N$4=\"\"),0,DonnéesFinales!O29)","v":0},{"$f":"IF(OR(DonnéesFinales!$R29=FALSE,O$4=\"\"),0,DonnéesFinales!P29)","v":0},{"$f":"IF(OR(DonnéesFinales!$R29=FALSE,P$4=\"\"),0,DonnéesFinales!Q29)","v":0},{"$f":"DonnéesFinales!$R29","v":false},{"$f":"IF(Q7=TRUE,40%,0)","v":0},{"$f":"IF(Q7=FALSE,40%,0)","v":0.4}]
[null,null,null,null,null,null,null,null,null,null,null,null,null,null,null,null,null,null,{"$f":"SUM(S5:S6)","v":0.2}]
[]
[null,null,null,1,"ComSaraison Sar Saire dk(ai,bj)",null,null,null,null,null,null,null,null,null,null,2,"Fonction de Sréférence F(dk(ai,bj))",null,null,null,null,null,null,null,null,null,null,3,"Degrée de Sréférence π(a,b)",null,null,null,null,null,null,null,null,null,null,4,"Flots de surclassement ф(ai,x)"]
[null,null,null,null,"S1","S2","S3","S4","S5","S6","S7","S8","S9","S10",null,null,"S1","S2","S3","S4","S5","S6","S7","S8","S9","S10",null,null,{"$f":"AB12","v":""},{"$f":"AB13","v":""},{"$f":"AB14","v":""},{"$f":"AB15","v":""},{"$f":"AB16","v":""},{"$f":"AB17","v":""},{"$f":"AB18","v":""},{"$f":"AB19","v":""},{"$f":"AB20","v":""},{"$f":"AB21","v":""},null,null,"ф+(x,a)","ф-(a,x)","ф(a,x)"]
[null,{"$f":"$C$51","v":0},{"$f":"C5","v":"Pourcentage de charge polluante éliminé"},"S1",0,{"$f":"-H5+G5","v":0},{"$f":"-I5+G5","v":0},{"$f":"-J5+G5","v":0},{"$f":"-K5+G5","v":0},{"$f":"-L5+G5","v":0},{"$f":"-M5+G5","v":0},{"$f":"-N5+G5","v":0},{"$f":"-O5+G5","v":0},{"$f":"-P5+G5","v":0},null,"S1",{"$f":"IF(E12>=0,0,1-EXP((-(E12^2))/(2*$B12^2)))","v":0},{"$f":"IF(F12>=0,0,1-EXP((-(F12^2))/(2*$B12^2)))","v":0},0,0,0,0,0,0,0,0,null,{"$f":"IF(DonnéesFinales!H$19=\"n/a\",\"\",\"T1\")","v":""},{"$f":"IF(OR($AB12=\"\",AC$11=\"\"),0,Q12*$D$5+Q23*$D$6+Q35*$D$7)","v":0},{"$f":"IF(OR($AB12=\"\",AD$11=\"\"),0,R12*$D$5+R23*$D$6+R35*$D$7)","v":0},{"$f":"IF(OR($AB12=\"\",AE$11=\"\"),0,S12*$D$5+S23*$D$6+S35*$D$7)","v":0},{"$f":"IF(OR($AB12=\"\",AF$11=\"\"),0,T12*$D$5+T23*$D$6+T35*$D$7)","v":0},{"$f":"IF(OR($AB12=\"\",AG$11=\"\"),0,U12*$D$5+U23*$D$6+U35*$D$7)","v":0},{"$f":"IF(OR($AB12=\"\",AH$11=\"\"),0,V12*$D$5+V23*$D$6+V35*$D$7)","v":0},{"$f":"IF(OR($AB12=\"\",AI$11=\"\"),0,W12*$D$5+W23*$D$6+W35*$D$7)","v":0},{"$f":"IF(OR($AB12=\"\",AJ$11=\"\"),0,X12*$D$5+X23*$D$6+X35*$D$7)","v":0},{"$f":"IF(OR($AB12=\"\",AK$11=\"\"),0,Y12*$D$5+Y23*$D$6+Y35*$D$7)","v":0},{"$f":"IF(OR($AB12=\"\",AL$11=\"\"),0,Z12*$D$5+Z23*$D$6+Z35*$D$7)","v":0},null,"S1",{"$f":"(1/($Q$3-1))*SUM(AC12:AL12)","v":0},{"$f":"(1/($Q$3-1))*SUM(AC12:AC21)","v":0},{"$f":"AO12-AP12","v":0}]
[null,0,null,"S2",{"$f":"-G5+H5","v":0},0,{"$f":"-I5+H5","v":0},{"$f":"-J5+H5","v":0},{"$f":"-K5+H5","v":0},{"$f":"-L5+H5","v":0},{"$f":"-M5+H5","v":0},{"$f":"-N5+H5","v":0},{"$f":"-O5+H5","v":0},{"$f":"-P5+H5","v":0},null,"S2",{"$f":"IF(E13>=0,0,1-EXP((-(E13^2))/(2*$B13^2)))","v":0},{"$f":"IF(F13>=0,0,1-EXP((-(F13^2))/(2*$B13^2)))","v":0},{"$f":"IF(G13>=0,0,1-EXP((-(G13^2))/(2*$B13^2)))","v":0},{"$f":"IF(H13>=0,0,1-EXP((-(H13^2))/(2*$B13^2)))","v":0},{"$f":"IF(I13>=0,0,1-EXP((-(I13^2))/(2*$B13^2)))","v":0},{"$f":"IF(J13>=0,0,1-EXP((-(J13^2))/(2*$B13^2)))","v":0},{"$f":"IF(K13>=0,0,1-EXP((-(K13^2))/(2*$B13^2)))","v":0},{"$f":"IF(L13>=0,0,1-EXP((-(L13^2))/(2*$B13^2)))","v":0},{"$f":"IF(M13>=0,0,1-EXP((-(M13^2))/(2*$B13^2)))","v":0},{"$f":"IF(N13>=0,0,1-EXP((-(N13^2))/(2*$B13^2)))","v":0},null,{"$f":"IF(DonnéesFinales!I$19=\"n/a\",\"\",\"T2\")","v":""},0,0,0,0,0,0,0,0,0,0,null,"S2",0,{"$f":"(1/($Q$3-1))*SUM(AD12:AD21)","v":0},{"$f":"AO13-AP13","v":0}]
[null,0,null,"S3",{"$f":"-G5+I5","v":0},{"$f":"-H5+I5","v":0},0,{"$f":"-J5+I5","v":0},{"$f":"-K5+I5","v":0},{"$f":"-L5+I5","v":0},{"$f":"-M5+I5","v":0},{"$f":"-N5+I5","v":0},{"$f":"-O5+I5","v":0},{"$f":"-P5+I5","v":0},null,"S3",0,0,0,0,0,0,0,0,0,0,null,{"$f":"IF(DonnéesFinales!J$19=\"n/a\",\"\",\"T3\")","v":""},0,0,0,0,0,0,0,0,0,0,null,"S3",0,{"$f":"(1/($Q$3-1))*SUM(AE12:AE21)","v":0},0]
[null,0,null,"S4",{"$f":"-G5+J5","v":0},{"$f":"-H5+J5","v":0},{"$f":"-I5+J5","v":0},0,{"$f":"-K5+J5","v":0},{"$f":"-L5+J5","v":0},{"$f":"-M5+J5","v":0},{"$f":"-N5+J5","v":0},{"$f":"-O5+J5","v":0},{"$f":"-P5+J5","v":0},null,"S4",0,0,0,0,0,0,0,0,0,0,null,{"$f":"IF(DonnéesFinales!K$19=\"n/a\",\"\",\"T4\")","v":""},0,0,0,0,0,0,0,0,0,0,null,"S4",0,{"$f":"(1/($Q$3-1))*SUM(AF12:AF21)","v":0},0]
[null,0,null,"S5",{"$f":"-G5+K5","v":0},{"$f":"-H5+K5","v":0},{"$f":"-I5+K5","v":0},{"$f":"-J5+K5","v":0},0,{"$f":"-L5+K5","v":0},{"$f":"-M5+K5","v":0},{"$f":"-N5+K5","v":0},{"$f":"-O5+K5","v":0},{"$f":"-P5+K5","v":0},null,"S5",0,0,0,0,0,0,0,0,0,0,null,{"$f":"IF(DonnéesFinales!L$19=\"n/a\",\"\",\"T5\")","v":""},0,0,0,0,0,0,0,0,0,0,null,"S5",0,{"$f":"(1/($Q$3-1))*SUM(AG12:AG21)","v":0},0]
[null,0,null,"S6",{"$f":"-G5+L5","v":0},{"$f":"-H5+L5","v":0},{"$f":"-I5+L5","v":0},{"$f":"-J5+L5","v":0},{"$f":"-K5+L5","v":0},0,{"$f":"-M5+L5","v":0},{"$f":"-N5+L5","v":0},{"$f":"-O5+L5","v":0},{"$f":"-P5+L5","v":0},null,"S6",0,0,0,0,0,0,0,0,0,0,null,{"$f":"IF(DonnéesFinales!M$19=\"n/a\",\"\",\"T6\")","v":""},0,0,0,0,0,0,0,0,0,0,null,"S6",0,{"$f":"(1/($Q$3-1))*SUM(AH12:AH21)","v":0},0]
[null,0,null,"S7",{"$f":"-G5+M5","v":0},{"$f":"-H5+M5","v":0},{"$f":"-I5+M5","v":0},{"$f":"-J5+M5","v":0},{"$f":"-K5+M5","v":0},{"$f":"-L5+M5","v":0},0,{"$f":"-N5+M5","v":0},{"$f":"-O5+M5","v":0},{"$f":"-P5+M5","v":0},null,"S7",0,0,0,0,0,0,0,0,0,0,null,{"$f":"IF(DonnéesFinales!N$19=\"n/a\",\"\",\"T7\")","v":""},0,0,0,0,0,0,0,0,0,0,null,"S7",0,{"$f":"(1/($Q$3-1))*SUM(AI12:AI21)","v":0},0]
[null,0,null,"S8",{"$f":"-G5+N5","v":0},{"$f":"-H5+N5","v":0},{"$f":"-I5+N5","v":0},{"$f":"-J5+N5","v":0},{"$f":"-K5+N5","v":0},{"$f":"-L5+N5","v":0},{"$f":"-M5+N5","v":0},0,{"$f":"-O5+N5","v":0},{"$f":"-P5+N5","v":0},null,"S8",0,0,0,0,0,0,0,0,0,0,null,{"$f":"IF(DonnéesFinales!O$19=\"n/a\",\"\",\"T8\")","v":""},0,0,0,0,0,0,0,0,0,0,null,"S8",0,{"$f":"(1/($Q$3-1))*SUM(AJ12:AJ21)","v":0},0]
[null,0,null,"S9",{"$f":"-G5+O5","v":0},{"$f":"-H5+O5","v":0},{"$f":"-I5+O5","v":0},{"$f":"-J5+O5","v":0},{"$f":"-K5+O5","v":0},{"$f":"-L5+O5","v":0},{"$f":"-M5+O5","v":0},{"$f":"-N5+O5","v":0},0,{"$f":"-P5+O5","v":0},null,"S9",0,0,0,0,0,0,0,0,0,0,null,{"$f":"IF(DonnéesFinales!P$19=\"n/a\",\"\",\"T9\")","v":""},0,0,0,0,0,0,0,0,0,0,null,"S9",0,{"$f":"(1/($Q$3-1))*SUM(AK12:AK21)","v":0},0]
[null,0,null,"S10",{"$f":"-G5+P5","v":0},{"$f":"-H5+P5","v":0},{"$f":"-I5+P5","v":0},{"$f":"-J5+P5","v":0},{"$f":"-K5+P5","v":0},{"$f":"-L5+P5","v":0},{"$f":"-M5+P5","v":0},{"$f":"-N5+P5","v":0},{"$f":"-O5+P5","v":0},0,null,"S10",0,0,0,0,0,0,0,0,0,0,null,{"$f":"IF(DonnéesFinales!Q$19=\"n/a\",\"\",\"T10\")","v":""},0,0,0,0,0,0,0,0,0,0,null,"S10",0,{"$f":"(1/($Q$3-1))*SUM(AL12:AL21)","v":0},0]
[]
[null,{"$f":"$C$62","v":0},{"$f":"C6","v":"Impact des actes et travaux sur les écosystèmes"},"S1",0,{"$f":"-H6+G6","v":0},{"$f":"-I6+G6","v":0},{"$f":"-J6+G6","v":0},{"$f":"-K6+G6","v":0},{"$f":"-L6+G6","v":0},{"$f":"-M6+G6","v":0},{"$f":"-N6+G6","v":0},{"$f":"-O6+G6","v":0},{"$f":"-P6+G6","v":0},null,"S1",{"$f":"IF(E23>=0,0,1-EXP((-(E23^2))/(2*$B23^2)))","v":0},{"$f":"IF(F23>=0,0,1-EXP((-(F23^2))/(2*$B23^2)))","v":0},0,0,0,0,0,0,0,0]
[null,0,null,"S2",{"$f":"-G6+H6","v":0},0,{"$f":"-I6+H6","v":0},{"$f":"-J6+H6","v":0},{"$f":"-K6+H6","v":0},{"$f":"-L6+H6","v":0},{"$f":"-M6+H6","v":0},{"$f":"-N6+H6","v":0},{"$f":"-O6+H6","v":0},{"$f":"-P6+H6","v":0},null,"S2",{"$f":"IF(E24>=0,0,1-EXP((-(E24^2))/(2*$B24^2)))","v":0},{"$f":"IF(F24>=0,0,1-EXP((-(F24^2))/(2*$B24^2)))","v":0},{"$f":"IF(G24>=0,0,1-EXP((-(G24^2))/(2*$B24^2)))","v":0},{"$f":"IF(H24>=0,0,1-EXP((-(H24^2))/(2*$B24^2)))","v":0},{"$f":"IF(I24>=0,0,1-EXP((-(I24^2))/(2*$B24^2)))","v":0},{"$f":"IF(J24>=0,0,1-EXP((-(J24^2))/(2*$B24^2)))","v":0},{"$f":"IF(K24>=0,0,1-EXP((-(K24^2))/(2*$B24^2)))","v":0},{"$f":"IF(L24>=0,0,1-EXP((-(L24^2))/(2*$B24^2)))","v":0},{"$f":"IF(M24>=0,0,1-EXP((-(M24^2))/(2*$B24^2)))","v":0},{"$f":"IF(N24>=0,0,1-EXP((-(N24^2))/(2*$B24^2)))","v":0}]
[null,0,null,"S3",{"$f":"-G6+I6","v":0},{"$f":"-H6+I6","v":0},0,{"$f":"-J6+I6","v":0},{"$f":"-K6+I6","v":0},{"$f":"-L6+I6","v":0},{"$f":"-M6+I6","v":0},{"$f":"-N6+I6","v":0},{"$f":"-O6+I6","v":0},{"$f":"-P6+I6","v":0},null,"S3",0,0,0,0,0,0,0,0,0,0]
[null,0,null,"S4",{"$f":"-G6+J6","v":0},{"$f":"-H6+J6","v":0},{"$f":"-I6+J6","v":0},0,{"$f":"-K6+J6","v":0},{"$f":"-L6+J6","v":0},{"$f":"-M6+J6","v":0},{"$f":"-N6+J6","v":0},{"$f":"-O6+J6","v":0},{"$f":"-P6+J6","v":0},null,"S4",0,0,0,0,0,0,0,0,0,0]
[null,0,null,"S5",{"$f":"-G6+K6","v":0},{"$f":"-H6+K6","v":0},{"$f":"-I6+K6","v":0},{"$f":"-J6+K6","v":0},0,{"$f":"-L6+K6","v":0},{"$f":"-M6+K6","v":0},{"$f":"-N6+K6","v":0},{"$f":"-O6+K6","v":0},{"$f":"-P6+K6","v":0},null,"S5",0,0,0,0,0,0,0,0,0,0]
[null,0,null,"S6",{"$f":"-G6+L6","v":0},{"$f":"-H6+L6","v":0},{"$f":"-I6+L6","v":0},{"$f":"-J6+L6","v":0},{"$f":"-K6+L6","v":0},0,{"$f":"-M6+L6","v":0},{"$f":"-N6+L6","v":0},{"$f":"-O6+L6","v":0},{"$f":"-P6+L6","v":0},null,"S6",0,0,0,0,0,0,0,0,0,0]
[null,0,null,"S7",{"$f":"-G6+M6","v":0},{"$f":"-H6+M6","v":0},{"$f":"-I6+M6","v":0},{"$f":"-J6+M6","v":0},{"$f":"-K6+M6","v":0},{"$f":"-L6+M6","v":0},0,{"$f":"-N6+M6","v":0},{"$f":"-O6+M6","v":0},{"$f":"-P6+M6","v":0},null,"S7",0,0,0,0,0,0,0,0,0,0]
[null,0,null,"S8",{"$f":"-G6+N6","v":0},{"$f":"-H6+N6","v":0},{"$f":"-I6+N6","v":0},{"$f":"-J6+N6","v":0},{"$f":"-K6+N6","v":0},{"$f":"-L6+N6","v":0},{"$f":"-M6+N6","v":0},0,{"$f":"-O6+N6","v":0},{"$f":"-P6+N6","v":0},null,"S8",0,0,0,0,0,0,0,0,0,0]
[null,0,null,"S9",{"$f":"-G6+O6","v":0},{"$f":"-H6+O6","v":0},{"$f":"-I6+O6","v":0},{"$f":"-J6+O6","v":0},{"$f":"-K6+O6","v":0},{"$f":"-L6+O6","v":0},{"$f":"-M6+O6","v":0},{"$f":"-N6+O6","v":0},0,{"$f":"-P6+O6","v":0},null,"S9",0,0,0,0,0,0,0,0,0,0]
[null,0,null,"S10",{"$f":"-G6+P6","v":0},{"$f":"-H6+P6","v":0},{"$f":"-I6+P6","v":0},{"$f":"-J6+P6","v":0},{"$f":"-K6+P6","v":0},{"$f":"-L6+P6","v":0},{"$f":"-M6+P6","v":0},{"$f":"-N6+P6","v":0},{"$f":"-O6+P6","v":0},0,null,"S10",0,0,0,0,0,0,0,0,0,0]
[]
[]
[null,{"$f":"$C$74","v":0},{"$f":"C7","v":"Risque de mobilisation du polluant (vers eau ou air)."},"S1",0,{"$f":"-H7+G7","v":0},{"$f":"-I7+G7","v":0},{"$f":"-J7+G7","v":0},{"$f":"-K7+G7","v":0},{"$f":"-L7+G7","v":0},{"$f":"-M7+G7","v":0},{"$f":"-N7+G7","v":0},{"$f":"-O7+G7","v":0},{"$f":"-P7+G7","v":0},null,"S1",{"$f":"IF(E35>=0,0,1-EXP((-(E35^2))/(2*$B35^2)))","v":0},{"$f":"IF(F35>=0,0,1-EXP((-(F35^2))/(2*$B35^2)))","v":0},0,0,0,0,0,0,0,0]
[null,0,null,"S2",{"$f":"-G7+H7","v":0},0,{"$f":"-I7+H7","v":0},{"$f":"-J7+H7","v":0},{"$f":"-K7+H7","v":0},{"$f":"-L7+H7","v":0},{"$f":"-M7+H7","v":0},{"$f":"-N7+H7","v":0},{"$f":"-O7+H7","v":0},{"$f":"-P7+H7","v":0},null,"S2",{"$f":"IF(E36>=0,0,1-EXP((-(E36^2))/(2*$B36^2)))","v":0},{"$f":"IF(F36>=0,0,1-EXP((-(F36^2))/(2*$B36^2)))","v":0},{"$f":"IF(G36>=0,0,1-EXP((-(G36^2))/(2*$B36^2)))","v":0},{"$f":"IF(H36>=0,0,1-EXP((-(H36^2))/(2*$B36^2)))","v":0},{"$f":"IF(I36>=0,0,1-EXP((-(I36^2))/(2*$B36^2)))","v":0},{"$f":"IF(J36>=0,0,1-EXP((-(J36^2))/(2*$B36^2)))","v":0},{"$f":"IF(K36>=0,0,1-EXP((-(K36^2))/(2*$B36^2)))","v":0},{"$f":"IF(L36>=0,0,1-EXP((-(L36^2))/(2*$B36^2)))","v":0},{"$f":"IF(M36>=0,0,1-EXP((-(M36^2))/(2*$B36^2)))","v":0},{"$f":"IF(N36>=0,0,1-EXP((-(N36^2))/(2*$B36^2)))","v":0}]
[null,0,null,"S3",{"$f":"-G7+I7","v":0},{"$f":"-H7+I7","v":0},0,{"$f":"-J7+I7","v":0},{"$f":"-K7+I7","v":0},{"$f":"-L7+I7","v":0},{"$f":"-M7+I7","v":0},{"$f":"-N7+I7","v":0},{"$f":"-O7+I7","v":0},{"$f":"-P7+I7","v":0},null,"S3",0,0,0,0,0,0,0,0,0,0]
[null,0,null,"S4",{"$f":"-G7+J7","v":0},{"$f":"-H7+J7","v":0},{"$f":"-I7+J7","v":0},0,{"$f":"-K7+J7","v":0},{"$f":"-L7+J7","v":0},{"$f":"-M7+J7","v":0},{"$f":"-N7+J7","v":0},{"$f":"-O7+J7","v":0},{"$f":"-P7+J7","v":0},null,"S4",0,0,0,0,0,0,0,0,0,0]
[null,0,null,"S5",{"$f":"-G7+K7","v":0},{"$f":"-H7+K7","v":0},{"$f":"-I7+K7","v":0},{"$f":"-J7+K7","v":0},0,{"$f":"-L7+K7","v":0},{"$f":"-M7+K7","v":0},{"$f":"-N7+K7","v":0},{"$f":"-O7+K7","v":0},{"$f":"-P7+K7","v":0},null,"S5",0,0,0,0,0,0,0,0,0,0]
[null,0,null,"S6",{"$f":"-G7+L7","v":0},{"$f":"-H7+L7","v":0},{"$f":"-I7+L7","v":0},{"$f":"-J7+L7","v":0},{"$f":"-K7+L7","v":0},0,{"$f":"-M7+L7","v":0},{"$f":"-N7+L7","v":0},{"$f":"-O7+L7","v":0},{"$f":"-P7+L7","v":0},null,"S6",0,0,0,0,0,0,0,0,0,0]
[null,0,null,"S7",{"$f":"-G7+M7","v":0},{"$f":"-H7+M7","v":0},{"$f":"-I7+M7","v":0},{"$f":"-J7+M7","v":0},{"$f":"-K7+M7","v":0},{"$f":"-L7+M7","v":0},0,{"$f":"-N7+M7","v":0},{"$f":"-O7+M7","v":0},{"$f":"-P7+M7","v":0},null,"S7",0,0,0,0,0,0,0,0,0,0]
[null,0,null,"S8",{"$f":"-G7+N7","v":0},{"$f":"-H7+N7","v":0},{"$f":"-I7+N7","v":0},{"$f":"-J7+N7","v":0},{"$f":"-K7+N7","v":0},{"$f":"-L7+N7","v":0},{"$f":"-M7+N7","v":0},0,{"$f":"-O7+N7","v":0},{"$f":"-P7+N7","v":0},null,"S8",0,0,0,0,0,0,0,0,0,0]
[null,0,null,"S9",{"$f":"-G7+O7","v":0},{"$f":"-H7+O7","v":0},{"$f":"-I7+O7","v":0},{"$f":"-J7+O7","v":0},{"$f":"-K7+O7","v":0},{"$f":"-L7+O7","v":0},{"$f":"-M7+O7","v":0},{"$f":"-N7+O7","v":0},0,{"$f":"-P7+O7","v":0},null,"S9",0,0,0,0,0,0,0,0,{"$f":"IF(M43>=0,0,1-EXP((-(M43^2))/(2*$B43^2)))","v":0},0]
[null,0,null,"S10",{"$f":"-G7+P7","v":0},{"$f":"-H7+P7","v":0},{"$f":"-I7+P7","v":0},{"$f":"-J7+P7","v":0},{"$f":"-K7+P7","v":0},{"$f":"-L7+P7","v":0},{"$f":"-M7+P7","v":0},{"$f":"-N7+P7","v":0},{"$f":"-O7+P7","v":0},0,null,"S10",0,0,0,0,0,0,0,0,0,0]
[]
[]
[]
[]
[null,null,null,1,"Comparaison par paire dk(ai,bj)"]
[null,null,null,null,{"$f":"G4","v":""},"","","","","","","","",""]
[null,null,{"$f":"IF(E5=\"Min\",(MIN(E51:N60)-MAX(E51:N60))/2,(MAX(E51:N60)-MIN(E51:N60))/2)","v":0},{"$f":"G4","v":""},"x",{"$f":"IF(AND(F$50=\"\",$D51=\"\"),\"x\",IF($E$5=\"Min\",IF(F12<=0,F12,\"X\"), IF(F12>=0,F12,\"X\")))","v":"x"},{"$f":"IF(AND(G$50=\"\",$D51=\"\"),\"x\",IF($E$5=\"Min\",IF(G12<=0,G12,\"X\"), IF(G12>=0,G12,\"X\")))","v":"x"},"x","x","x","x","x","x","x"]
[null,null,null,{"$f":"H4","v":""},{"$f":"IF(AND(E$50=\"\",$D52=\"\"),\"x\",IF($E$5=\"Min\",IF(E13<=0,E13,\"X\"), IF(E13>=0,E13,\"X\")))","v":"x"},"x","x","x","x","x","x","x","x","x"]
[null,null,null,{"$f":"I4","v":""},{"$f":"IF(AND(E$50=\"\",$D53=\"\"),\"x\",IF($E$5=\"Min\",IF(E14<=0,E14,\"X\"), IF(E14>=0,E14,\"X\")))","v":"x"},"x","x","x","x","x","x","x","x","x"]
[null,null,null,{"$f":"J4","v":""},{"$f":"IF(AND(E$50=\"\",$D54=\"\"),\"x\",IF($E$5=\"Min\",IF(E15<=0,E15,\"X\"), IF(E15>=0,E15,\"X\")))","v":"x"},"x","x","x","x","x","x","x","x","x"]
[null,null,null,{"$f":"K4","v":""},{"$f":"IF(AND(E$50=\"\",$D55=\"\"),\"x\",IF($E$5=\"Min\",IF(E16<=0,E16,\"X\"), IF(E16>=0,E16,\"X\")))","v":"x"},"x","x",{"$f":"IF(AND(H$50=\"\",$D55=\"\"),\"x\",IF($E$5=\"Min\",IF(H16<=0,H16,\"X\"), IF(H16>=0,H16,\"X\")))","v":"x"},"x","x","x","x","x","x"]
[null,null,null,{"$f":"L4","v":""},{"$f":"IF(AND(E$50=\"\",$D56=\"\"),\"x\",IF($E$5=\"Min\",IF(E17<=0,E17,\"X\"), IF(E17>=0,E17,\"X\")))","v":"x"},"x","x","x","x","x","x","x","x","x"]
[null,null,null,{"$f":"M4","v":""},{"$f":"IF(AND(E$50=\"\",$D57=\"\"),\"x\",IF($E$5=\"Min\",IF(E18<=0,E18,\"X\"), IF(E18>=0,E18,\"X\")))","v":"x"},"x","x","x","x","x","x","x","x","x"]
[null,null,null,{"$f":"N4","v":""},{"$f":"IF(AND(E$50=\"\",$D58=\"\"),\"x\",IF($E$5=\"Min\",IF(E19<=0,E19,\"X\"), IF(E19>=0,E19,\"X\")))","v":"x"},"x","x","x","x","x","x","x","x","x"]
[null,null,null,{"$f":"O4","v":""},{"$f":"IF(AND(E$50=\"\",$D59=\"\"),\"x\",IF($E$5=\"Min\",IF(E20<=0,E20,\"X\"), IF(E20>=0,E20,\"X\")))","v":"x"},"x","x","x","x","x","x","x","x","x"]
[null,null,null,{"$f":"P4","v":""},{"$f":"IF(AND(E$50=\"\",$D60=\"\"),\"x\",IF($E$5=\"Min\",IF(E21<=0,E21,\"X\"), IF(E21>=0,E21,\"X\")))","v":"x"},"x","x","x","x","x","x","x","x","x"]
[]
[null,null,{"$f":"IF(E6=\"Min\",(MIN(E62:N71)-MAX(E62:N71))/2,(MAX(E62:N71)-MIN(E62:N71))/2)","v":0},{"$f":"G4","v":""},"x",{"$f":"IF(AND(F$50=\"\",$D62=\"\"),\"x\",IF($E$6=\"Min\",IF(F23<=0,F23,\"X\"), IF(F23>=0,\"X\",F23)))","v":"x"},"x","x","x","x","x","x","x","x"]
[null,null,null,{"$f":"H4","v":""},{"$f":"IF(AND(E$50=\"\",$D63=\"\"),\"x\",IF($E$6=\"Min\",IF(E24<=0,E24,\"X\"), IF(E24>=0,\"X\",E24)))","v":"x"},"x",{"$f":"IF(AND(G$50=\"\",$D63=\"\"),\"x\",IF($E$6=\"Min\",IF(G24<=0,G24,\"X\"), IF(G24>=0,\"X\",G24)))","v":"x"},"x","x","x","x","x","x","x"]
[null,null,null,{"$f":"I4","v":""},"x",{"$f":"IF(AND(F$50=\"\",$D64=\"\"),\"x\",IF($E$6=\"Min\",IF(F25<=0,F25,\"X\"), IF(F25>=0,\"X\",F25)))","v":"x"},"x",{"$f":"IF(AND(H$50=\"\",$D64=\"\"),\"x\",IF($E$6=\"Min\",IF(H25<=0,H25,\"X\"), IF(H25>=0,\"X\",H25)))","v":"x"},"x","x","x","x","x","x"]
[null,null,null,{"$f":"J4","v":""},"x","x",{"$f":"IF(AND(G$50=\"\",$D65=\"\"),\"x\",IF($E$6=\"Min\",IF(G26<=0,G26,\"X\"), IF(G26>=0,\"X\",G26)))","v":"x"},"x",{"$f":"IF(AND(I$50=\"\",$D65=\"\"),\"x\",IF($E$6=\"Min\",IF(I26<=0,I26,\"X\"), IF(I26>=0,\"X\",I26)))","v":"x"},"x","x","x","x","x"]
[null,null,null,{"$f":"K4","v":""},"x","x","x",{"$f":"IF(AND(H$50=\"\",$D66=\"\"),\"x\",IF($E$6=\"Min\",IF(H27<=0,H27,\"X\"), IF(H27>=0,\"X\",H27)))","v":"x"},"x",{"$f":"IF(AND(J$50=\"\",$D66=\"\"),\"x\",IF($E$6=\"Min\",IF(J27<=0,J27,\"X\"), IF(J27>=0,\"X\",J27)))","v":"x"},{"$f":"IF(AND(K$50=\"\",$D66=\"\"),\"x\",IF($E$6=\"Min\",IF(K27<=0,K27,\"X\"), IF(K27>=0,\"X\",K27)))","v":"x"},{"$f":"IF(AND(L$50=\"\",$D66=\"\"),\"x\",IF($E$6=\"Min\",IF(L27<=0,L27,\"X\"), IF(L27>=0,\"X\",L27)))","v":"x"},{"$f":"IF(AND(M$50=\"\",$D66=\"\"),\"x\",IF($E$6=\"Min\",IF(M27<=0,M27,\"X\"), IF(M27>=0,\"X\",M27)))","v":"x"},{"$f":"IF(AND(N$50=\"\",$D66=\"\"),\"x\",IF($E$6=\"Min\",IF(N27<=0,N27,\"X\"), IF(N27>=0,\"X\",N27)))","v":"x"}]
[null,null,null,{"$f":"L4","v":""},"x","x","x","x",{"$f":"IF(AND(I$50=\"\",$D67=\"\"),\"x\",IF($E$6=\"Min\",IF(I28<=0,I28,\"X\"), IF(I28>=0,\"X\",I28)))","v":"x"},"x",{"$f":"IF(AND(K$50=\"\",$D67=\"\"),\"x\",IF($E$6=\"Min\",IF(K28<=0,K28,\"X\"), IF(K28>=0,\"X\",K28)))","v":"x"},{"$f":"IF(AND(L$50=\"\",$D67=\"\"),\"x\",IF($E$6=\"Min\",IF(L28<=0,L28,\"X\"), IF(L28>=0,\"X\",L28)))","v":"x"},{"$f":"IF(AND(M$50=\"\",$D67=\"\"),\"x\",IF($E$6=\"Min\",IF(M28<=0,M28,\"X\"), IF(M28>=0,\"X\",M28)))","v":"x"},{"$f":"IF(AND(N$50=\"\",$D67=\"\"),\"x\",IF($E$6=\"Min\",IF(N28<=0,N28,\"X\"), IF(N28>=0,\"X\",N28)))","v":"x"}]
[null,null,null,{"$f":"M4","v":""},"x","x","x","x",{"$f":"IF(AND(I$50=\"\",$D68=\"\"),\"x\",IF($E$6=\"Min\",IF(I29<=0,I29,\"X\"), IF(I29>=0,\"X\",I29)))","v":"x"},{"$f":"IF(AND(J$50=\"\",$D68=\"\"),\"x\",IF($E$6=\"Min\",IF(J29<=0,J29,\"X\"), IF(J29>=0,\"X\",J29)))","v":"x"},"x",{"$f":"IF(AND(L$50=\"\",$D68=\"\"),\"x\",IF($E$6=\"Min\",IF(L29<=0,L29,\"X\"), IF(L29>=0,\"X\",L29)))","v":"x"},{"$f":"IF(AND(M$50=\"\",$D68=\"\"),\"x\",IF($E$6=\"Min\",IF(M29<=0,M29,\"X\"), IF(M29>=0,\"X\",M29)))","v":"x"},{"$f":"IF(AND(N$50=\"\",$D68=\"\"),\"x\",IF($E$6=\"Min\",IF(N29<=0,N29,\"X\"), IF(N29>=0,\"X\",N29)))","v":"x"}]
[null,null,null,{"$f":"N4","v":""},"x","x","x","x",{"$f":"IF(AND(I$50=\"\",$D69=\"\"),\"x\",IF($E$6=\"Min\",IF(I30<=0,I30,\"X\"), IF(I30>=0,\"X\",I30)))","v":"x"},{"$f":"IF(AND(J$50=\"\",$D69=\"\"),\"x\",IF($E$6=\"Min\",IF(J30<=0,J30,\"X\"), IF(J30>=0,\"X\",J30)))","v":"x"},{"$f":"IF(AND(K$50=\"\",$D69=\"\"),\"x\",IF($E$6=\"Min\",IF(K30<=0,K30,\"X\"), IF(K30>=0,\"X\",K30)))","v":"x"},"x",{"$f":"IF(AND(M$50=\"\",$D69=\"\"),\"x\",IF($E$6=\"Min\",IF(M30<=0,M30,\"X\"), IF(M30>=0,\"X\",M30)))","v":"x"},{"$f":"IF(AND(N$50=\"\",$D69=\"\"),\"x\",IF($E$6=\"Min\",IF(N30<=0,N30,\"X\"), IF(N30>=0,\"X\",N30)))","v":"x"}]
[null,null,null,{"$f":"O4","v":""},"x","x","x","x",{"$f":"IF(AND(I$50=\"\",$D70=\"\"),\"x\",IF($E$6=\"Min\",IF(I31<=0,I31,\"X\"), IF(I31>=0,\"X\",I31)))","v":"x"},{"$f":"IF(AND(J$50=\"\",$D70=\"\"),\"x\",IF($E$6=\"Min\",IF(J31<=0,J31,\"X\"), IF(J31>=0,\"X\",J31)))","v":"x"},{"$f":"IF(AND(K$50=\"\",$D70=\"\"),\"x\",IF($E$6=\"Min\",IF(K31<=0,K31,\"X\"), IF(K31>=0,\"X\",K31)))","v":"x"},{"$f":"IF(AND(L$50=\"\",$D70=\"\"),\"x\",IF($E$6=\"Min\",IF(L31<=0,L31,\"X\"), IF(L31>=0,\"X\",L31)))","v":"x"},"x",{"$f":"IF(AND(N$50=\"\",$D70=\"\"),\"x\",IF($E$6=\"Min\",IF(N31<=0,N31,\"X\"), IF(N31>=0,\"X\",N31)))","v":"x"}]
[null,null,null,{"$f":"P4","v":""},"x","x","x","x",{"$f":"IF(AND(I$50=\"\",$D71=\"\"),\"x\",IF($E$6=\"Min\",IF(I32<=0,I32,\"X\"), IF(I32>=0,\"X\",I32)))","v":"x"},{"$f":"IF(AND(J$50=\"\",$D71=\"\"),\"x\",IF($E$6=\"Min\",IF(J32<=0,J32,\"X\"), IF(J32>=0,\"X\",J32)))","v":"x"},{"$f":"IF(AND(K$50=\"\",$D71=\"\"),\"x\",IF($E$6=\"Min\",IF(K32<=0,K32,\"X\"), IF(K32>=0,\"X\",K32)))","v":"x"},{"$f":"IF(AND(L$50=\"\",$D71=\"\"),\"x\",IF($E$6=\"Min\",IF(L32<=0,L32,\"X\"), IF(L32>=0,\"X\",L32)))","v":"x"},{"$f":"IF(AND(M$50=\"\",$D71=\"\"),\"x\",IF($E$6=\"Min\",IF(M32<=0,M32,\"X\"), IF(M32>=0,\"X\",M32)))","v":"x"},"x"]
[]
[]
[null,null,{"$f":"IF(E7=\"Min\",(MIN(E74:N83)-MAX(E74:N83))/2,(MAX(E74:N83)-MIN(E74:N83))/2)","v":0},{"$f":"G4","v":""},"x",{"$f":"IF(AND(F$50=\"\",$D74=\"\"),\"x\",IF($E$7=\"Min\",IF(F35<=0,F35,\"X\"), IF(F35>=0,\"X\",F35)))","v":"x"},"x","x","x","x","x","x","x","x"]
[null,null,null,{"$f":"H4","v":""},{"$f":"IF(AND(E$50=\"\",$D75=\"\"),\"x\",IF($E$7=\"Min\",IF(E36<=0,E36,\"X\"), IF(E36>=0,\"X\",E36)))","v":"x"},"x",{"$f":"IF(AND(G$50=\"\",$D75=\"\"),\"x\",IF($E$7=\"Min\",IF(G36<=0,G36,\"X\"), IF(G36>=0,\"X\",G36)))","v":"x"},"x","x","x","x","x","x","x"]
[null,null,null,{"$f":"I4","v":""},"x",{"$f":"IF(AND(F$50=\"\",$D76=\"\"),\"x\",IF($E$7=\"Min\",IF(F37<=0,F37,\"X\"), IF(F37>=0,\"X\",F37)))","v":"x"},"x",{"$f":"IF(AND(H$50=\"\",$D76=\"\"),\"x\",IF($E$7=\"Min\",IF(H37<=0,H37,\"X\"), IF(H37>=0,\"X\",H37)))","v":"x"},"x","x","x","x","x","x"]
[null,null,null,{"$f":"J4","v":""},"x","x",{"$f":"IF(AND(G$50=\"\",$D77=\"\"),\"x\",IF($E$7=\"Min\",IF(G38<=0,G38,\"X\"), IF(G38>=0,\"X\",G38)))","v":"x"},"x",{"$f":"IF(AND(I$50=\"\",$D77=\"\"),\"x\",IF($E$7=\"Min\",IF(I38<=0,I38,\"X\"), IF(I38>=0,\"X\",I38)))","v":"x"},"x","x","x","x","x"]
[null,null,null,{"$f":"K4","v":""},"x","x","x",{"$f":"IF(AND(H$50=\"\",$D78=\"\"),\"x\",IF($E$7=\"Min\",IF(H39<=0,H39,\"X\"), IF(H39>=0,\"X\",H39)))","v":"x"},"x",{"$f":"IF(AND(J$50=\"\",$D78=\"\"),\"x\",IF($E$7=\"Min\",IF(J39<=0,J39,\"X\"), IF(J39>=0,\"X\",J39)))","v":"x"},{"$f":"IF(AND(K$50=\"\",$D78=\"\"),\"x\",IF($E$7=\"Min\",IF(K39<=0,K39,\"X\"), IF(K39>=0,\"X\",K39)))","v":"x"},{"$f":"IF(AND(L$50=\"\",$D78=\"\"),\"x\",IF($E$7=\"Min\",IF(L39<=0,L39,\"X\"), IF(L39>=0,\"X\",L39)))","v":"x"},{"$f":"IF(AND(M$50=\"\",$D78=\"\"),\"x\",IF($E$7=\"Min\",IF(M39<=0,M39,\"X\"), IF(M39>=0,\"X\",M39)))","v":"x"},{"$f":"IF(AND(N$50=\"\",$D78=\"\"),\"x\",IF($E$7=\"Min\",IF(N39<=0,N39,\"X\"), IF(N39>=0,\"X\",N39)))","v":"x"}]
[null,null,null,{"$f":"L4","v":""},"x","x","x","x",{"$f":"IF(AND(I$50=\"\",$D79=\"\"),\"x\",IF($E$7=\"Min\",IF(I40<=0,I40,\"X\"), IF(I40>=0,\"X\",I40)))","v":"x"},"x",{"$f":"IF(AND(K$50=\"\",$D79=\"\"),\"x\",IF($E$7=\"Min\",IF(K40<=0,K40,\"X\"), IF(K40>=0,\"X\",K40)))","v":"x"},{"$f":"IF(AND(L$50=\"\",$D79=\"\"),\"x\",IF($E$7=\"Min\",IF(L40<=0,L40,\"X\"), IF(L40>=0,\"X\",L40)))","v":"x"},{"$f":"IF(AND(M$50=\"\",$D79=\"\"),\"x\",IF($E$7=\"Min\",IF(M40<=0,M40,\"X\"), IF(M40>=0,\"X\",M40)))","v":"x"},{"$f":"IF(AND(N$50=\"\",$D79=\"\"),\"x\",IF($E$7=\"Min\",IF(N40<=0,N40,\"X\"), IF(N40>=0,\"X\",N40)))","v":"x"}]
[null,null,null,{"$f":"M4","v":""},"x","x","x","x",{"$f":"IF(AND(I$50=\"\",$D80=\"\"),\"x\",IF($E$7=\"Min\",IF(I41<=0,I41,\"X\"), IF(I41>=0,\"X\",I41)))","v":"x"},{"$f":"IF(AND(J$50=\"\",$D80=\"\"),\"x\",IF($E$7=\"Min\",IF(J41<=0,J41,\"X\"), IF(J41>=0,\"X\",J41)))","v":"x"},"x",{"$f":"IF(AND(L$50=\"\",$D80=\"\"),\"x\",IF($E$7=\"Min\",IF(L41<=0,L41,\"X\"), IF(L41>=0,\"X\",L41)))","v":"x"},{"$f":"IF(AND(M$50=\"\",$D80=\"\"),\"x\",IF($E$7=\"Min\",IF(M41<=0,M41,\"X\"), IF(M41>=0,\"X\",M41)))","v":"x"},{"$f":"IF(AND(N$50=\"\",$D80=\"\"),\"x\",IF($E$7=\"Min\",IF(N41<=0,N41,\"X\"), IF(N41>=0,\"X\",N41)))","v":"x"}]
[null,null,null,{"$f":"N4","v":""},"x","x","x","x",{"$f":"IF(AND(I$50=\"\",$D81=\"\"),\"x\",IF($E$7=\"Min\",IF(I42<=0,I42,\"X\"), IF(I42>=0,\"X\",I42)))","v":"x"},{"$f":"IF(AND(J$50=\"\",$D81=\"\"),\"x\",IF($E$7=\"Min\",IF(J42<=0,J42,\"X\"), IF(J42>=0,\"X\",J42)))","v":"x"},{"$f":"IF(AND(K$50=\"\",$D81=\"\"),\"x\",IF($E$7=\"Min\",IF(K42<=0,K42,\"X\"), IF(K42>=0,\"X\",K42)))","v":"x"},"x",{"$f":"IF(AND(M$50=\"\",$D81=\"\"),\"x\",IF($E$7=\"Min\",IF(M42<=0,M42,\"X\"), IF(M42>=0,\"X\",M42)))","v":"x"},{"$f":"IF(AND(N$50=\"\",$D81=\"\"),\"x\",IF($E$7=\"Min\",IF(N42<=0,N42,\"X\"), IF(N42>=0,\"X\",N42)))","v":"x"}]
[null,null,null,{"$f":"O4","v":""},"x","x","x","x",{"$f":"IF(AND(I$50=\"\",$D82=\"\"),\"x\",IF($E$7=\"Min\",IF(I43<=0,I43,\"X\"), IF(I43>=0,\"X\",I43)))","v":"x"},{"$f":"IF(AND(J$50=\"\",$D82=\"\"),\"x\",IF($E$7=\"Min\",IF(J43<=0,J43,\"X\"), IF(J43>=0,\"X\",J43)))","v":"x"},{"$f":"IF(AND(K$50=\"\",$D82=\"\"),\"x\",IF($E$7=\"Min\",IF(K43<=0,K43,\"X\"), IF(K43>=0,\"X\",K43)))","v":"x"},{"$f":"IF(AND(L$50=\"\",$D82=\"\"),\"x\",IF($E$7=\"Min\",IF(L43<=0,L43,\"X\"), IF(L43>=0,\"X\",L43)))","v":"x"},"x",{"$f":"IF(AND(N$50=\"\",$D82=\"\"),\"x\",IF($E$7=\"Min\",IF(N43<=0,N43,\"X\"), IF(N43>=0,\"X\",N43)))","v":"x"}]
[null,null,null,{"$f":"P4","v":""},"x","x","x","x",{"$f":"IF(AND(I$50=\"\",$D83=\"\"),\"x\",IF($E$7=\"Min\",IF(I44<=0,I44,\"X\"), IF(I44>=0,\"X\",I44)))","v":"x"},{"$f":"IF(AND(J$50=\"\",$D83=\"\"),\"x\",IF($E$7=\"Min\",IF(J44<=0,J44,\"X\"), IF(J44>=0,\"X\",J44)))","v":"x"},{"$f":"IF(AND(K$50=\"\",$D83=\"\"),\"x\",IF($E$7=\"Min\",IF(K44<=0,K44,\"X\"), IF(K44>=0,\"X\",K44)))","v":"x"},{"$f":"IF(AND(L$50=\"\",$D83=\"\"),\"x\",IF($E$7=\"Min\",IF(L44<=0,L44,\"X\"), IF(L44>=0,\"X\",L44)))","v":"x"},{"$f":"IF(AND(M$50=\"\",$D83=\"\"),\"x\",IF($E$7=\"Min\",IF(M44<=0,M44,\"X\"), IF(M44>=0,\"X\",M44)))","v":"x"},"x"]

{"sheet":"Envi-Glob","index":20,"n_rows":103,"n_cols":43,"rows_kept":103,"cut":false,"hidden":true,"merged":[[24,2,33,2],[1,2,1,38],[11,4,11,13],[11,16,11,25],[11,28,11,37],[13,2,22,2],[93,2,102,2],[35,2,44,2],[46,2,55,2],[58,4,58,13],[60,2,69,2],[71,2,80,2],[82,2,91,2]]}
[]
[null,null,"Environnement Globale"]
[null,null,null,null,null,null,{"$f":"IF(G4=\"\",0,1)","v":0},0,0,0,0,0,0,0,0,0,{"$f":"SUM(G3:P3)","v":0}]
[null,{"$f":"SUM(B5:B8)","v":2},null,null,null,null,{"$f":"IF(DonnéesFinales!H$19=\"n/a\",\"\",\"T1\")","v":""},{"$f":"IF(DonnéesFinales!I$19=\"n/a\",\"\",\"T2\")","v":""},{"$f":"IF(DonnéesFinales!J$19=\"n/a\",\"\",\"T3\")","v":""},{"$f":"IF(DonnéesFinales!K$19=\"n/a\",\"\",\"T4\")","v":""},{"$f":"IF(DonnéesFinales!L$19=\"n/a\",\"\",\"T5\")","v":""},{"$f":"IF(DonnéesFinales!M$19=\"n/a\",\"\",\"T6\")","v":""},{"$f":"IF(DonnéesFinales!N$19=\"n/a\",\"\",\"T7\")","v":""},{"$f":"IF(DonnéesFinales!O$19=\"n/a\",\"\",\"T8\")","v":""},{"$f":"IF(DonnéesFinales!P$19=\"n/a\",\"\",\"T9\")","v":""},{"$f":"IF(DonnéesFinales!Q$19=\"n/a\",\"\",\"T10\")","v":""},null,true,false]
[null,{"$f":"IF(Q5=TRUE,1,0)","v":0},{"$f":"DonnéesFinales!D31","v":"Réstauration de la fonctionalité sol"},{"$f":"R5+IF(Q5=TRUE,$S$9/$B$4,0%)","v":0},{"$f":"DonnéesFinales!F31","v":"Min"},{"$f":"DonnéesFinales!G22","v":"Unité"},{"$f":"IF(OR(DonnéesFinales!$R31=FALSE,G$4=\"\"),0,DonnéesFinales!H31)","v":0},{"$f":"IF(OR(DonnéesFinales!$R31=FALSE,H$4=\"\"),0,DonnéesFinales!I31)","v":0},{"$f":"IF(OR(DonnéesFinales!$R31=FALSE,I$4=\"\"),0,DonnéesFinales!J31)","v":0},{"$f":"IF(OR(DonnéesFinales!$R31=FALSE,J$4=\"\"),0,DonnéesFinales!K31)","v":0},{"$f":"IF(OR(DonnéesFinales!$R31=FALSE,K$4=\"\"),0,DonnéesFinales!L31)","v":0},{"$f":"IF(OR(DonnéesFinales!$R31=FALSE,L$4=\"\"),0,DonnéesFinales!M31)","v":0},{"$f":"IF(OR(DonnéesFinales!$R31=FALSE,M$4=\"\"),0,DonnéesFinales!N31)","v":0},{"$f":"IF(OR(DonnéesFinales!$R31=FALSE,N$4=\"\"),0,DonnéesFinales!O31)","v":0},{"$f":"IF(OR(DonnéesFinales!$R31=FALSE,O$4=\"\"),0,DonnéesFinales!P31)","v":0},{"$f":"IF(OR(DonnéesFinales!$R31=FALSE,P$4=\"\"),0,DonnéesFinales!Q31)","v":0},{"$f":"DonnéesFinales!$R31","v":false},{"$f":"IF(Q5=TRUE,31.02%,0)","v":0},{"$f":"IF(Q5=FALSE,31.02%,0)","v":0.31019999999999998}]
[null,{"$f":"IF(Q6=TRUE,1,0)","v":0},{"$f":"DonnéesFinales!D32","v":"Impact sur la biodiversité"},{"$f":"R6+IF(Q6=TRUE,$S$9/$B$4,0%)","v":0},{"$f":"DonnéesFinales!F32","v":"Min"},{"$f":"DonnéesFinales!G23","v":"Unité"},{"$f":"IF(OR(DonnéesFinales!$R32=FALSE,G$4=\"\"),0,DonnéesFinales!H32)","v":0},{"$f":"IF(OR(DonnéesFinales!$R32=FALSE,H$4=\"\"),0,DonnéesFinales!I32)","v":0},{"$f":"IF(OR(DonnéesFinales!$R32=FALSE,I$4=\"\"),0,DonnéesFinales!J32)","v":0},{"$f":"IF(OR(DonnéesFinales!$R32=FALSE,J$4=\"\"),0,DonnéesFinales!K32)","v":0},{"$f":"IF(OR(DonnéesFinales!$R32=FALSE,K$4=\"\"),0,DonnéesFinales!L32)","v":0},{"$f":"IF(OR(DonnéesFinales!$R32=FALSE,L$4=\"\"),0,DonnéesFinales!M32)","v":0},{"$f":"IF(OR(DonnéesFinales!$R32=FALSE,M$4=\"\"),0,DonnéesFinales!N32)","v":0},{"$f":"IF(OR(DonnéesFinales!$R32=FALSE,N$4=\"\"),0,DonnéesFinales!O32)","v":0},{"$f":"IF(OR(DonnéesFinales!$R32=FALSE,O$4=\"\"),0,DonnéesFinales!P32)","v":0},{"$f":"IF(OR(DonnéesFinales!$R32=FALSE,P$4=\"\"),0,DonnéesFinales!Q32)","v":0},{"$f":"DonnéesFinales!$R32","v":false},{"$f":"IF(Q6=TRUE,12.65%,0)","v":0},{"$f":"IF(Q6=FALSE,12.65%,0)","v":0.1265}]
[null,1,{"$f":"DonnéesFinales!D33","v":"Bilan écologique (eau énergie déchets émissions)"},0.47144999999999998,{"$f":"DonnéesFinales!F33","v":"Min"},{"$f":"DonnéesFinales!G24","v":"Unité"},{"$f":"IF(OR(DonnéesFinales!$R33=FALSE,G$4=\"\"),0,DonnéesFinales!H33)","v":0},{"$f":"IF(OR(DonnéesFinales!$R33=FALSE,H$4=\"\"),0,DonnéesFinales!I33)","v":0},{"$f":"IF(OR(DonnéesFinales!$R33=FALSE,I$4=\"\"),0,DonnéesFinales!J33)","v":0},{"$f":"IF(OR(DonnéesFinales!$R33=FALSE,J$4=\"\"),0,DonnéesFinales!K33)","v":0},{"$f":"IF(OR(DonnéesFinales!$R33=FALSE,K$4=\"\"),0,DonnéesFinales!L33)","v":0},{"$f":"IF(OR(DonnéesFinales!$R33=FALSE,L$4=\"\"),0,DonnéesFinales!M33)","v":0},{"$f":"IF(OR(DonnéesFinales!$R33=FALSE,M$4=\"\"),0,DonnéesFinales!N33)","v":0},{"$f":"IF(OR(DonnéesFinales!$R33=FALSE,N$4=\"\"),0,DonnéesFinales!O33)","v":0},{"$f":"IF(OR(DonnéesFinales!$R33=FALSE,O$4=\"\"),0,DonnéesFinales!P33)","v":0},{"$f":"IF(OR(DonnéesFinales!$R33=FALSE,P$4=\"\"),0,DonnéesFinales!Q33)","v":0},{"$f":"DonnéesFinales!$R33","v":true},{"$f":"IF(Q7=TRUE,25.31%,0)","v":0.25309999999999999},{"$f":"IF(Q7=FALSE,25.31%,0)","v":0}]
[null,1,{"$f":"DonnéesFinales!D34","v":"Energie"},0.52854999999999996,{"$f":"DonnéesFinales!F34","v":"Min"},{"$f":"DonnéesFinales!G25","v":"Unité"},{"$f":"IF(OR(DonnéesFinales!$R34=FALSE,G$4=\"\"),0,DonnéesFinales!H34)","v":0},{"$f":"IF(OR(DonnéesFinales!$R34=FALSE,H$4=\"\"),0,DonnéesFinales!I34)","v":0},{"$f":"IF(OR(DonnéesFinales!$R34=FALSE,I$4=\"\"),0,DonnéesFinales!J34)","v":0},{"$f":"IF(OR(DonnéesFinales!$R34=FALSE,J$4=\"\"),0,DonnéesFinales!K34)","v":0},{"$f":"IF(OR(DonnéesFinales!$R34=FALSE,K$4=\"\"),0,DonnéesFinales!L34)","v":0},{"$f":"IF(OR(DonnéesFinales!$R34=FALSE,L$4=\"\"),0,DonnéesFinales!M34)","v":0},{"$f":"IF(OR(DonnéesFinales!$R34=FALSE,M$4=\"\"),0,DonnéesFinales!N34)","v":0},{"$f":"IF(OR(DonnéesFinales!$R34=FALSE,N$4=\"\"),0,DonnéesFinales!O34)","v":0},{"$f":"IF(OR(DonnéesFinales!$R34=FALSE,O$4=\"\"),0,DonnéesFinales!P34)","v":0},{"$f":"IF(OR(DonnéesFinales!$R34=FALSE,P$4=\"\"),0,DonnéesFinales!Q34)","v":0},{"$f":"DonnéesFinales!$R34","v":true},{"$f":"IF(Q8=TRUE,31.02%,0)","v":0.31019999999999998},{"$f":"IF(Q8=FALSE,31.02%,0)","v":0}]
[null,null,null,null,null,null,null,null,null,null,null,null,null,null,null,null,null,null,{"$f":"SUM(S5:S8)","v":0.43669999999999998}]
[]
[]
[null,"Sigma",null,1,"Comparaison par paire dk(ai,bj)",null,null,null,null,null,null,null,null,null,null,2,"Fonction de préférence F(dk(ai,bj))",null,null,null,null,null,null,null,null,null,null,3,"Degrée de préférence π(a,b)",null,null,null,null,null,null,null,null,null,null,4,"Flots de surclassement ф(ai,x)"]
[null,null,null,null,"S1","S2","S3","S4","S5","S6","S7","S8","S9","S10",null,null,"S1","S2","S3","S4","S5","S6","S7","S8","S9","S10",null,null,{"$f":"AB14","v":""},{"$f":"AB15","v":""},{"$f":"AB16","v":""},{"$f":"AB17","v":""},{"$f":"AB18","v":""},{"$f":"AB19","v":""},{"$f":"AB20","v":""},{"$f":"AB21","v":""},{"$f":"AB22","v":""},{"$f":"AB23","v":""},null,null,"ф+(x,a)","ф-(a,x)","ф(a,x)"]
[null,{"$f":"$C$61/2","v":0},{"$f":"C5","v":"Réstauration de la fonctionalité sol"},"S1",0,{"$f":"-H5+G5","v":0},{"$f":"-I5+G5","v":0},{"$f":"-J5+G5","v":0},{"$f":"-K5+G5","v":0},{"$f":"-L5+G5","v":0},{"$f":"-M5+G5","v":0},{"$f":"-N5+G5","v":0},{"$f":"-O5+G5","v":0},{"$f":"-P5+G5","v":0},null,"S1",{"$f":"IF(E14>=0,0,1-EXP((-(E14^2))/(2*$B14^2)))","v":0},{"$f":"IF(F14>=0,0,1-EXP((-(F14^2))/(2*$B14^2)))","v":0},0,0,0,0,0,0,0,0,null,{"$f":"IF(DonnéesFinales!H$19=\"n/a\",\"\",\"T1\")","v":""},{"$f":"IF(OR($AB14=\"\",AC$13=\"\"),0,Q14*$D$5+Q25*$D$6+Q36*$D$7+Q47*$D$8)","v":0},0,0,0,0,0,0,0,0,0,null,"P1",{"$f":"(1/($Q$3-1))*SUM(AC14:AL14)","v":0},{"$f":"(1/($Q$3-1))*SUM(AC14:AC23)","v":0},{"$f":"AO14-AP14","v":0}]
[null,{"$f":"$C$61/2","v":0},null,"S2",{"$f":"-G5+H5","v":0},0,{"$f":"-I5+H5","v":0},{"$f":"-J5+H5","v":0},{"$f":"-K5+H5","v":0},{"$f":"-L5+H5","v":0},{"$f":"-M5+H5","v":0},{"$f":"-N5+H5","v":0},{"$f":"-O5+H5","v":0},{"$f":"-P5+H5","v":0},null,"S2",{"$f":"IF(E15>=0,0,1-EXP((-(E15^2))/(2*$B15^2)))","v":0},{"$f":"IF(F15>=0,0,1-EXP((-(F15^2))/(2*$B15^2)))","v":0},{"$f":"IF(G15>=0,0,1-EXP((-(G15^2))/(2*$B15^2)))","v":0},{"$f":"IF(H15>=0,0,1-EXP((-(H15^2))/(2*$B15^2)))","v":0},{"$f":"IF(I15>=0,0,1-EXP((-(I15^2))/(2*$B15^2)))","v":0},{"$f":"IF(J15>=0,0,1-EXP((-(J15^2))/(2*$B15^2)))","v":0},{"$f":"IF(K15>=0,0,1-EXP((-(K15^2))/(2*$B15^2)))","v":0},{"$f":"IF(L15>=0,0,1-EXP((-(L15^2))/(2*$B15^2)))","v":0},{"$f":"IF(M15>=0,0,1-EXP((-(M15^2))/(2*$B15^2)))","v":0},{"$f":"IF(N15>=0,0,1-EXP((-(N15^2))/(2*$B15^2)))","v":0},null,{"$f":"IF(DonnéesFinales!I$19=\"n/a\",\"\",\"T2\")","v":""},0,0,0,0,0,0,0,0,0,0,null,"P2",0,{"$f":"(1/($Q$3-1))*SUM(AD14:AD23)","v":0},{"$f":"AO15-AP15","v":0}]
[null,0,null,"S3",{"$f":"-G5+I5","v":0},{"$f":"-H5+I5","v":0},0,{"$f":"-J5+I5","v":0},{"$f":"-K5+I5","v":0},{"$f":"-L5+I5","v":0},{"$f":"-M5+I5","v":0},{"$f":"-N5+I5","v":0},{"$f":"-O5+I5","v":0},{"$f":"-P5+I5","v":0},null,"S3",0,0,0,0,0,0,0,0,0,0,null,{"$f":"IF(DonnéesFinales!J$19=\"n/a\",\"\",\"T3\")","v":""},0,0,0,0,0,0,0,0,0,0,null,"P3",0,{"$f":"(1/($Q$3-1))*SUM(AE14:AE23)","v":0},0]
[null,0,null,"S4",{"$f":"-G5+J5","v":0},{"$f":"-H5+J5","v":0},{"$f":"-I5+J5","v":0},0,{"$f":"-K5+J5","v":0},{"$f":"-L5+J5","v":0},{"$f":"-M5+J5","v":0},{"$f":"-N5+J5","v":0},{"$f":"-O5+J5","v":0},{"$f":"-P5+J5","v":0},null,"S4",0,0,0,0,0,0,0,0,0,0,null,{"$f":"IF(DonnéesFinales!K$19=\"n/a\",\"\",\"T4\")","v":""},0,0,0,0,0,0,0,0,0,0,null,"P4",0,{"$f":"(1/($Q$3-1))*SUM(AF14:AF23)","v":0},0]
[null,0,null,"S5",{"$f":"-G5+K5","v":0},{"$f":"-H5+K5","v":0},{"$f":"-I5+K5","v":0},{"$f":"-J5+K5","v":0},0,{"$f":"-L5+K5","v":0},{"$f":"-M5+K5","v":0},{"$f":"-N5+K5","v":0},{"$f":"-O5+K5","v":0},{"$f":"-P5+K5","v":0},null,"S5",0,0,0,0,0,0,0,0,0,0,null,{"$f":"IF(DonnéesFinales!L$19=\"n/a\",\"\",\"T5\")","v":""},0,0,0,0,0,0,0,0,0,0,null,"P5",0,{"$f":"(1/($Q$3-1))*SUM(AG14:AG23)","v":0},0]
[null,0,null,"S6",{"$f":"-G5+L5","v":0},{"$f":"-H5+L5","v":0},{"$f":"-I5+L5","v":0},{"$f":"-J5+L5","v":0},{"$f":"-K5+L5","v":0},0,{"$f":"-M5+L5","v":0},{"$f":"-N5+L5","v":0},{"$f":"-O5+L5","v":0},{"$f":"-P5+L5","v":0},null,"S6",0,0,0,0,0,0,0,0,0,0,null,{"$f":"IF(DonnéesFinales!M$19=\"n/a\",\"\",\"T6\")","v":""},0,0,0,0,0,0,0,0,0,0,null,"P6",0,{"$f":"(1/($Q$3-1))*SUM(AH14:AH23)","v":0},0]
[null,0,null,"S7",{"$f":"-G5+M5","v":0},{"$f":"-H5+M5","v":0},{"$f":"-I5+M5","v":0},{"$f":"-J5+M5","v":0},{"$f":"-K5+M5","v":0},{"$f":"-L5+M5","v":0},0,{"$f":"-N5+M5","v":0},{"$f":"-O5+M5","v":0},{"$f":"-P5+M5","v":0},null,"S7",0,0,0,0,0,0,0,0,0,0,null,{"$f":"IF(DonnéesFinales!N$19=\"n/a\",\"\",\"T7\")","v":""},0,0,0,0,0,0,0,0,0,0,null,"P7",0,{"$f":"(1/($Q$3-1))*SUM(AI14:AI23)","v":0},0]
[null,0,null,"S8",{"$f":"-G5+N5","v":0},{"$f":"-H5+N5","v":0},{"$f":"-I5+N5","v":0},{"$f":"-J5+N5","v":0},{"$f":"-K5+N5","v":0},{"$f":"-L5+N5","v":0},{"$f":"-M5+N5","v":0},0,{"$f":"-O5+N5","v":0},{"$f":"-P5+N5","v":0},null,"S8",0,0,0,0,0,0,0,0,0,0,null,{"$f":"IF(DonnéesFinales!O$19=\"n/a\",\"\",\"T8\")","v":""},0,0,0,0,0,0,0,0,0,0,null,"P8",0,{"$f":"(1/($Q$3-1))*SUM(AJ14:AJ23)","v":0},0]
[null,0,null,"S9",{"$f":"-G5+O5","v":0},{"$f":"-H5+O5","v":0},{"$f":"-I5+O5","v":0},{"$f":"-J5+O5","v":0},{"$f":"-K5+O5","v":0},{"$f":"-L5+O5","v":0},{"$f":"-M5+O5","v":0},{"$f":"-N5+O5","v":0},0,{"$f":"-P5+O5","v":0},null,"S9",0,0,0,0,0,0,0,0,0,0,null,{"$f":"IF(DonnéesFinales!P$19=\"n/a\",\"\",\"T9\")","v":""},0,0,0,0,0,0,0,0,0,0,null,"P9",0,{"$f":"(1/($Q$3-1))*SUM(AK14:AK23)","v":0},0]
[null,0,null,"S10",{"$f":"-G5+P5","v":0},{"$f":"-H5+P5","v":0},{"$f":"-I5+P5","v":0},{"$f":"-J5+P5","v":0},{"$f":"-K5+P5","v":0},{"$f":"-L5+P5","v":0},{"$f":"-M5+P5","v":0},{"$f":"-N5+P5","v":0},{"$f":"-O5+P5","v":0},0,null,"S10",0,0,0,0,0,0,0,0,0,0,null,{"$f":"IF(DonnéesFinales!Q$19=\"n/a\",\"\",\"T10\")","v":""},0,0,0,0,0,0,0,0,0,0,null,"P10",0,{"$f":"(1/($Q$3-1))*SUM(AL14:AL23)","v":0},0]
[]
[null,{"$f":"$C$72/2","v":0},{"$f":"C6","v":"Impact sur la biodiversité"},"S1",0,{"$f":"-H6+G6","v":0},{"$f":"-I6+G6","v":0},{"$f":"-J6+G6","v":0},{"$f":"-K6+G6","v":0},{"$f":"-L6+G6","v":0},{"$f":"-M6+G6","v":0},{"$f":"-N6+G6","v":0},{"$f":"-O6+G6","v":0},{"$f":"-P6+G6","v":0},null,"S1",{"$f":"IF(E25>=0,0,1-EXP((-(E25^2))/(2*$B25^2)))","v":0},{"$f":"IF(F25>=0,0,1-EXP((-(F25^2))/(2*$B25^2)))","v":0},0,0,0,0,0,0,0,0]
[null,{"$f":"$C$72/2","v":0},null,"S2",{"$f":"-G6+H6","v":0},0,{"$f":"-I6+H6","v":0},{"$f":"-J6+H6","v":0},{"$f":"-K6+H6","v":0},{"$f":"-L6+H6","v":0},{"$f":"-M6+H6","v":0},{"$f":"-N6+H6","v":0},{"$f":"-O6+H6","v":0},{"$f":"-P6+H6","v":0},null,"S2",{"$f":"IF(E26>=0,0,1-EXP((-(E26^2))/(2*$B26^2)))","v":0},{"$f":"IF(F26>=0,0,1-EXP((-(F26^2))/(2*$B26^2)))","v":0},{"$f":"IF(G26>=0,0,1-EXP((-(G26^2))/(2*$B26^2)))","v":0},{"$f":"IF(H26>=0,0,1-EXP((-(H26^2))/(2*$B26^2)))","v":0},{"$f":"IF(I26>=0,0,1-EXP((-(I26^2))/(2*$B26^2)))","v":0},{"$f":"IF(J26>=0,0,1-EXP((-(J26^2))/(2*$B26^2)))","v":0},{"$f":"IF(K26>=0,0,1-EXP((-(K26^2))/(2*$B26^2)))","v":0},{"$f":"IF(L26>=0,0,1-EXP((-(L26^2))/(2*$B26^2)))","v":0},{"$f":"IF(M26>=0,0,1-EXP((-(M26^2))/(2*$B26^2)))","v":0},{"$f":"IF(N26>=0,0,1-EXP((-(N26^2))/(2*$B26^2)))","v":0}]
[null,0,null,"S3",{"$f":"-G6+I6","v":0},{"$f":"-H6+I6","v":0},0,{"$f":"-J6+I6","v":0},{"$f":"-K6+I6","v":0},{"$f":"-L6+I6","v":0},{"$f":"-M6+I6","v":0},{"$f":"-N6+I6","v":0},{"$f":"-O6+I6","v":0},{"$f":"-P6+I6","v":0},null,"S3",0,0,0,0,0,0,0,0,0,0]
[null,0,null,"S4",{"$f":"-G6+J6","v":0},{"$f":"-H6+J6","v":0},{"$f":"-I6+J6","v":0},0,{"$f":"-K6+J6","v":0},{"$f":"-L6+J6","v":0},{"$f":"-M6+J6","v":0},{"$f":"-N6+J6","v":0},{"$f":"-O6+J6","v":0},{"$f":"-P6+J6","v":0},null,"S4",0,0,0,0,0,0,0,0,0,0]
[null,0,null,"S5",{"$f":"-G6+K6","v":0},{"$f":"-H6+K6","v":0},{"$f":"-I6+K6","v":0},{"$f":"-J6+K6","v":0},0,{"$f":"-L6+K6","v":0},{"$f":"-M6+K6","v":0},{"$f":"-N6+K6","v":0},{"$f":"-O6+K6","v":0},{"$f":"-P6+K6","v":0},null,"S5",0,0,0,0,0,0,0,0,0,0]
[null,0,null,"S6",{"$f":"-G6+L6","v":0},{"$f":"-H6+L6","v":0},{"$f":"-I6+L6","v":0},{"$f":"-J6+L6","v":0},{"$f":"-K6+L6","v":0},0,{"$f":"-M6+L6","v":0},{"$f":"-N6+L6","v":0},{"$f":"-O6+L6","v":0},{"$f":"-P6+L6","v":0},null,"S6",0,0,0,0,0,0,0,0,0,0]
[null,0,null,"S7",{"$f":"-G6+M6","v":0},{"$f":"-H6+M6","v":0},{"$f":"-I6+M6","v":0},{"$f":"-J6+M6","v":0},{"$f":"-K6+M6","v":0},{"$f":"-L6+M6","v":0},0,{"$f":"-N6+M6","v":0},{"$f":"-O6+M6","v":0},{"$f":"-P6+M6","v":0},null,"S7",0,0,0,0,0,0,0,0,0,0]
[null,0,null,"S8",{"$f":"-G6+N6","v":0},{"$f":"-H6+N6","v":0},{"$f":"-I6+N6","v":0},{"$f":"-J6+N6","v":0},{"$f":"-K6+N6","v":0},{"$f":"-L6+N6","v":0},{"$f":"-M6+N6","v":0},0,{"$f":"-O6+N6","v":0},{"$f":"-P6+N6","v":0},null,"S8",0,0,0,0,0,0,0,0,0,0]
[null,0,null,"S9",{"$f":"-G6+O6","v":0},{"$f":"-H6+O6","v":0},{"$f":"-I6+O6","v":0},{"$f":"-J6+O6","v":0},{"$f":"-K6+O6","v":0},{"$f":"-L6+O6","v":0},{"$f":"-M6+O6","v":0},{"$f":"-N6+O6","v":0},0,{"$f":"-P6+O6","v":0},null,"S9",0,0,0,0,0,0,0,0,0,0]
[null,0,null,"S10",{"$f":"-G6+P6","v":0},{"$f":"-H6+P6","v":0},{"$f":"-I6+P6","v":0},{"$f":"-J6+P6","v":0},{"$f":"-K6+P6","v":0},{"$f":"-L6+P6","v":0},{"$f":"-M6+P6","v":0},{"$f":"-N6+P6","v":0},{"$f":"-O6+P6","v":0},0,null,"S10",0,0,0,0,0,0,0,0,0,0]
[]
[null,{"$f":"$C$83/2","v":0},{"$f":"C7","v":"Bilan écologique (eau énergie déchets émissions)"},"S1",0,{"$f":"-H7+G7","v":0},{"$f":"-I7+G7","v":0},{"$f":"-J7+G7","v":0},{"$f":"-K7+G7","v":0},{"$f":"-L7+G7","v":0},{"$f":"-M7+G7","v":0},{"$f":"-N7+G7","v":0},{"$f":"-O7+G7","v":0},{"$f":"-P7+G7","v":0},null,"S1",{"$f":"IF(E36>=0,0,1-EXP((-(E36^2))/(2*$B36^2)))","v":0},{"$f":"IF(F36>=0,0,1-EXP((-(F36^2))/(2*$B36^2)))","v":0},0,0,0,0,0,0,0,0]
[null,{"$f":"$C$83/2","v":0},null,"S2",{"$f":"-G7+H7","v":0},0,{"$f":"-I7+H7","v":0},{"$f":"-J7+H7","v":0},{"$f":"-K7+H7","v":0},{"$f":"-L7+H7","v":0},{"$f":"-M7+H7","v":0},{"$f":"-N7+H7","v":0},{"$f":"-O7+H7","v":0},{"$f":"-P7+H7","v":0},null,"S2",{"$f":"IF(E37>=0,0,1-EXP((-(E37^2))/(2*$B37^2)))","v":0},{"$f":"IF(F37>=0,0,1-EXP((-(F37^2))/(2*$B37^2)))","v":0},{"$f":"IF(G37>=0,0,1-EXP((-(G37^2))/(2*$B37^2)))","v":0},{"$f":"IF(H37>=0,0,1-EXP((-(H37^2))/(2*$B37^2)))","v":0},{"$f":"IF(I37>=0,0,1-EXP((-(I37^2))/(2*$B37^2)))","v":0},{"$f":"IF(J37>=0,0,1-EXP((-(J37^2))/(2*$B37^2)))","v":0},{"$f":"IF(K37>=0,0,1-EXP((-(K37^2))/(2*$B37^2)))","v":0},{"$f":"IF(L37>=0,0,1-EXP((-(L37^2))/(2*$B37^2)))","v":0},{"$f":"IF(M37>=0,0,1-EXP((-(M37^2))/(2*$B37^2)))","v":0},{"$f":"IF(N37>=0,0,1-EXP((-(N37^2))/(2*$B37^2)))","v":0}]
[null,0,null,"S3",{"$f":"-G7+I7","v":0},{"$f":"-H7+I7","v":0},0,{"$f":"-J7+I7","v":0},{"$f":"-K7+I7","v":0},{"$f":"-L7+I7","v":0},{"$f":"-M7+I7","v":0},{"$f":"-N7+I7","v":0},{"$f":"-O7+I7","v":0},{"$f":"-P7+I7","v":0},null,"S3",0,0,0,0,0,0,0,0,0,0]
[null,0,null,"S4",{"$f":"-G7+J7","v":0},{"$f":"-H7+J7","v":0},{"$f":"-I7+J7","v":0},0,{"$f":"-K7+J7","v":0},{"$f":"-L7+J7","v":0},{"$f":"-M7+J7","v":0},{"$f":"-N7+J7","v":0},{"$f":"-O7+J7","v":0},{"$f":"-P7+J7","v":0},null,"S4",0,0,0,0,0,0,0,0,0,0]
[null,0,null,"S5",{"$f":"-G7+K7","v":0},{"$f":"-H7+K7","v":0},{"$f":"-I7+K7","v":0},{"$f":"-J7+K7","v":0},0,{"$f":"-L7+K7","v":0},{"$f":"-M7+K7","v":0},{"$f":"-N7+K7","v":0},{"$f":"-O7+K7","v":0},{"$f":"-P7+K7","v":0},null,"S5",0,0,0,0,0,0,0,0,0,0]
[null,0,null,"S6",{"$f":"-G7+L7","v":0},{"$f":"-H7+L7","v":0},{"$f":"-I7+L7","v":0},{"$f":"-J7+L7","v":0},{"$f":"-K7+L7","v":0},0,{"$f":"-M7+L7","v":0},{"$f":"-N7+L7","v":0},{"$f":"-O7+L7","v":0},{"$f":"-P7+L7","v":0},null,"S6",0,0,0,0,0,0,0,0,0,0]
[null,0,null,"S7",{"$f":"-G7+M7","v":0},{"$f":"-H7+M7","v":0},{"$f":"-I7+M7","v":0},{"$f":"-J7+M7","v":0},{"$f":"-K7+M7","v":0},{"$f":"-L7+M7","v":0},0,{"$f":"-N7+M7","v":0},{"$f":"-O7+M7","v":0},{"$f":"-P7+M7","v":0},null,"S7",0,0,0,0,0,0,0,0,0,0]
[null,0,null,"S8",{"$f":"-G7+N7","v":0},{"$f":"-H7+N7","v":0},{"$f":"-I7+N7","v":0},{"$f":"-J7+N7","v":0},{"$f":"-K7+N7","v":0},{"$f":"-L7+N7","v":0},{"$f":"-M7+N7","v":0},0,{"$f":"-O7+N7","v":0},{"$f":"-P7+N7","v":0},null,"S8",0,0,0,0,0,0,0,0,0,0]
[null,0,null,"S9",{"$f":"-G7+O7","v":0},{"$f":"-H7+O7","v":0},{"$f":"-I7+O7","v":0},{"$f":"-J7+O7","v":0},{"$f":"-K7+O7","v":0},{"$f":"-L7+O7","v":0},{"$f":"-M7+O7","v":0},{"$f":"-N7+O7","v":0},0,{"$f":"-P7+O7","v":0},null,"S9",0,0,0,0,0,0,0,0,0,0]
[null,0,null,"S10",{"$f":"-G7+P7","v":0},{"$f":"-H7+P7","v":0},{"$f":"-I7+P7","v":0},{"$f":"-J7+P7","v":0},{"$f":"-K7+P7","v":0},{"$f":"-L7+P7","v":0},{"$f":"-M7+P7","v":0},{"$f":"-N7+P7","v":0},{"$f":"-O7+P7","v":0},0,null,"S10",0,0,0,0,0,0,0,0,0,0]
[]
[null,{"$f":"$C$94/2","v":0},{"$f":"C8","v":"Energie"},"S1",0,{"$f":"-H8+G8","v":0},{"$f":"-I8+G8","v":0},{"$f":"-J8+G8","v":0},{"$f":"-K8+G8","v":0},{"$f":"-L8+G8","v":0},{"$f":"-M8+G8","v":0},{"$f":"-N8+G8","v":0},{"$f":"-O8+G8","v":0},{"$f":"-P8+G8","v":0},null,"S1",{"$f":"IF(E47>=0,0,1-EXP((-(E47^2))/(2*$B47^2)))","v":0},{"$f":"IF(F47>=0,0,1-EXP((-(F47^2))/(2*$B47^2)))","v":0},0,0,0,0,0,0,0,0]
[null,{"$f":"$C$94/2","v":0},null,"S2",{"$f":"-G8+H8","v":0},0,{"$f":"-I8+H8","v":0},{"$f":"-J8+H8","v":0},{"$f":"-K8+H8","v":0},{"$f":"-L8+H8","v":0},{"$f":"-M8+H8","v":0},{"$f":"-N8+H8","v":0},{"$f":"-O8+H8","v":0},{"$f":"-P8+H8","v":0},null,"S2",{"$f":"IF(E48>=0,0,1-EXP((-(E48^2))/(2*$B48^2)))","v":0},{"$f":"IF(F48>=0,0,1-EXP((-(F48^2))/(2*$B48^2)))","v":0},{"$f":"IF(G48>=0,0,1-EXP((-(G48^2))/(2*$B48^2)))","v":0},{"$f":"IF(H48>=0,0,1-EXP((-(H48^2))/(2*$B48^2)))","v":0},{"$f":"IF(I48>=0,0,1-EXP((-(I48^2))/(2*$B48^2)))","v":0},{"$f":"IF(J48>=0,0,1-EXP((-(J48^2))/(2*$B48^2)))","v":0},{"$f":"IF(K48>=0,0,1-EXP((-(K48^2))/(2*$B48^2)))","v":0},{"$f":"IF(L48>=0,0,1-EXP((-(L48^2))/(2*$B48^2)))","v":0},{"$f":"IF(M48>=0,0,1-EXP((-(M48^2))/(2*$B48^2)))","v":0},{"$f":"IF(N48>=0,0,1-EXP((-(N48^2))/(2*$B48^2)))","v":0}]
[null,0,null,"S3",{"$f":"-G8+I8","v":0},{"$f":"-H8+I8","v":0},0,{"$f":"-J8+I8","v":0},{"$f":"-K8+I8","v":0},{"$f":"-L8+I8","v":0},{"$f":"-M8+I8","v":0},{"$f":"-N8+I8","v":0},{"$f":"-O8+I8","v":0},{"$f":"-P8+I8","v":0},null,"S3",0,0,0,0,0,0,0,0,0,0]
[null,0,null,"S4",{"$f":"-G8+J8","v":0},{"$f":"-H8+J8","v":0},{"$f":"-I8+J8","v":0},0,{"$f":"-K8+J8","v":0},{"$f":"-L8+J8","v":0},{"$f":"-M8+J8","v":0},{"$f":"-N8+J8","v":0},{"$f":"-O8+J8","v":0},{"$f":"-P8+J8","v":0},null,"S4",0,0,0,0,0,0,0,0,0,0]
[null,0,null,"S5",{"$f":"-G8+K8","v":0},{"$f":"-H8+K8","v":0},{"$f":"-I8+K8","v":0},{"$f":"-J8+K8","v":0},0,{"$f":"-L8+K8","v":0},{"$f":"-M8+K8","v":0},{"$f":"-N8+K8","v":0},{"$f":"-O8+K8","v":0},{"$f":"-P8+K8","v":0},null,"S5",0,0,0,0,0,0,0,0,0,0]
[null,0,null,"S6",{"$f":"-G8+L8","v":0},{"$f":"-H8+L8","v":0},{"$f":"-I8+L8","v":0},{"$f":"-J8+L8","v":0},{"$f":"-K8+L8","v":0},0,{"$f":"-M8+L8","v":0},{"$f":"-N8+L8","v":0},{"$f":"-O8+L8","v":0},{"$f":"-P8+L8","v":0},null,"S6",0,0,0,0,0,0,0,0,0,0]
[null,0,null,"S7",{"$f":"-G8+M8","v":0},{"$f":"-H8+M8","v":0},{"$f":"-I8+M8","v":0},{"$f":"-J8+M8","v":0},{"$f":"-K8+M8","v":0},{"$f":"-L8+M8","v":0},0,{"$f":"-N8+M8","v":0},{"$f":"-O8+M8","v":0},{"$f":"-P8+M8","v":0},null,"S7",0,0,0,0,0,0,0,0,0,0]
[null,0,null,"S8",{"$f":"-G8+N8","v":0},{"$f":"-H8+N8","v":0},{"$f":"-I8+N8","v":0},{"$f":"-J8+N8","v":0},{"$f":"-K8+N8","v":0},{"$f":"-L8+N8","v":0},{"$f":"-M8+N8","v":0},0,{"$f":"-O8+N8","v":0},{"$f":"-P8+N8","v":0},null,"S8",0,0,0,0,0,0,0,0,0,0]
[null,0,null,"S9",{"$f":"-G8+O8","v":0},{"$f":"-H8+O8","v":0},{"$f":"-I8+O8","v":0},{"$f":"-J8+O8","v":0},{"$f":"-K8+O8","v":0},{"$f":"-L8+O8","v":0},{"$f":"-M8+O8","v":0},{"$f":"-N8+O8","v":0},0,{"$f":"-P8+O8","v":0},null,"S9",0,0,0,0,0,0,0,0,0,0]
[null,0,null,"S10",{"$f":"-G8+P8","v":0},{"$f":"-H8+P8","v":0},{"$f":"-I8+P8","v":0},{"$f":"-J8+P8","v":0},{"$f":"-K8+P8","v":0},{"$f":"-L8+P8","v":0},{"$f":"-M8+P8","v":0},{"$f":"-N8+P8","v":0},{"$f":"-O8+P8","v":0},0,null,"S10",0,0,0,0,0,0,0,0,0,0]
[]
[]
[null,null,null,1,"Comparaison par paire dk(ai,bj)"]
[null,null,null,null,{"$f":"G4","v":""},"","","","","","","","",""]
[null,null,{"$f":"IF(E5=\"Min\",MIN(E61:N70)-MAX(E61:N70),MAX(E61:N70)-MIN(E61:N70))","v":0},{"$f":"G4","v":""},"x",{"$f":"IF(AND(F$60=\"\",$D61=\"\"),\"x\",IF($E$5=\"Min\",IF(F14<=0,F14,\"min\"), IF(F14>=0,F14,\"max\")))","v":"x"},{"$f":"IF(AND(G$60=\"\",$D61=\"\"),\"x\",IF($E$5=\"Min\",IF(G14<=0,G14,\"min\"), IF(G14>=0,G14,\"max\")))","v":"x"},"x","x","x","x","x","x","x"]
[null,null,null,{"$f":"H4","v":""},{"$f":"IF(AND(E$60=\"\",$D62=\"\"),\"x\",IF($E$5=\"Min\",IF(E15<=0,E15,\"min\"), IF(E15>=0,E15,\"max\")))","v":"x"},"x",{"$f":"IF(AND(G$60=\"\",$D62=\"\"),\"x\",IF($E$5=\"Min\",IF(G15<=0,G15,\"min\"), IF(G15>=0,G15,\"max\")))","v":"x"},"x","x","x","x","x","x","x"]
[null,null,null,{"$f":"I4","v":""},{"$f":"IF(AND(E$60=\"\",$D63=\"\"),\"x\",IF($E$5=\"Min\",IF(E16<=0,E16,\"min\"), IF(E16>=0,E16,\"max\")))","v":"x"},{"$f":"IF(AND(F$60=\"\",$D63=\"\"),\"x\",IF($E$5=\"Min\",IF(F16<=0,F16,\"min\"), IF(F16>=0,F16,\"max\")))","v":"x"},"x","x","x","x","x","x","x","x"]
[null,null,null,{"$f":"J4","v":""},{"$f":"IF(AND(E$60=\"\",$D64=\"\"),\"x\",IF($E$5=\"Min\",IF(E17<=0,E17,\"min\"), IF(E17>=0,E17,\"max\")))","v":"x"},{"$f":"IF(AND(F$60=\"\",$D64=\"\"),\"x\",IF($E$5=\"Min\",IF(F17<=0,F17,\"min\"), IF(F17>=0,F17,\"max\")))","v":"x"},"x","x","x","x","x","x","x","x"]
[null,null,null,{"$f":"K4","v":""},{"$f":"IF(AND(E$60=\"\",$D65=\"\"),\"x\",IF($E$5=\"Min\",IF(E18<=0,E18,\"min\"), IF(E18>=0,E18,\"max\")))","v":"x"},{"$f":"IF(AND(F$60=\"\",$D65=\"\"),\"x\",IF($E$5=\"Min\",IF(F18<=0,F18,\"min\"), IF(F18>=0,F18,\"max\")))","v":"x"},"x","x","x","x","x","x","x","x"]
[null,null,null,{"$f":"L4","v":""},{"$f":"IF(AND(E$60=\"\",$D66=\"\"),\"x\",IF($E$5=\"Min\",IF(E19<=0,E19,\"min\"), IF(E19>=0,E19,\"max\")))","v":"x"},{"$f":"IF(AND(F$60=\"\",$D66=\"\"),\"x\",IF($E$5=\"Min\",IF(F19<=0,F19,\"min\"), IF(F19>=0,F19,\"max\")))","v":"x"},"x","x","x","x","x","x","x","x"]
[null,null,null,{"$f":"M4","v":""},{"$f":"IF(AND(E$60=\"\",$D67=\"\"),\"x\",IF($E$5=\"Min\",IF(E20<=0,E20,\"min\"), IF(E20>=0,E20,\"max\")))","v":"x"},{"$f":"IF(AND(F$60=\"\",$D67=\"\"),\"x\",IF($E$5=\"Min\",IF(F20<=0,F20,\"min\"), IF(F20>=0,F20,\"max\")))","v":"x"},"x","x","x","x","x","x","x","x"]
[null,null,null,{"$f":"N4","v":""},{"$f":"IF(AND(E$60=\"\",$D68=\"\"),\"x\",IF($E$5=\"Min\",IF(E21<=0,E21,\"min\"), IF(E21>=0,E21,\"max\")))","v":"x"},{"$f":"IF(AND(F$60=\"\",$D68=\"\"),\"x\",IF($E$5=\"Min\",IF(F21<=0,F21,\"min\"), IF(F21>=0,F21,\"max\")))","v":"x"},"x","x","x","x","x","x","x","x"]
[null,null,null,{"$f":"O4","v":""},{"$f":"IF(AND(E$60=\"\",$D69=\"\"),\"x\",IF($E$5=\"Min\",IF(E22<=0,E22,\"min\"), IF(E22>=0,E22,\"max\")))","v":"x"},{"$f":"IF(AND(F$60=\"\",$D69=\"\"),\"x\",IF($E$5=\"Min\",IF(F22<=0,F22,\"min\"), IF(F22>=0,F22,\"max\")))","v":"x"},"x","x","x","x","x","x","x","x"]
[null,null,null,{"$f":"P4","v":""},{"$f":"IF(AND(E$60=\"\",$D70=\"\"),\"x\",IF($E$5=\"Min\",IF(E23<=0,E23,\"min\"), IF(E23>=0,E23,\"max\")))","v":"x"},{"$f":"IF(AND(F$60=\"\",$D70=\"\"),\"x\",IF($E$5=\"Min\",IF(F23<=0,F23,\"min\"), IF(F23>=0,F23,\"max\")))","v":"x"},"x","x","x","x","x","x","x","x"]
[]
[null,null,{"$f":"IF(E6=\"Min\",MIN(E72:N81)-MAX(E72:N81),MAX(E72:N81)-MIN(E72:N81))","v":0},{"$f":"G4","v":""},"x",{"$f":"IF(AND(F$60=\"\",$D72=\"\"),\"x\",IF($E$6=\"Min\",IF(F25<=0,F25,\"X\"), IF(F25>=0,F25,\"max\")))","v":"x"},{"$f":"IF(AND(G$60=\"\",$D72=\"\"),\"x\",IF($E$6=\"Min\",IF(G25<=0,G25,\"X\"), IF(G25>=0,G25,\"max\")))","v":"x"},"x","x","x","x","x","x","x"]
[null,null,null,{"$f":"H4","v":""},{"$f":"IF(AND(E$60=\"\",$D73=\"\"),\"x\",IF($E$6=\"Min\",IF(E26<=0,E26,\"X\"), IF(E26>=0,E26,\"max\")))","v":"x"},"x","x","x","x","x","x","x","x","x"]
[null,null,null,{"$f":"I4","v":""},{"$f":"IF(AND(E$60=\"\",$D74=\"\"),\"x\",IF($E$6=\"Min\",IF(E27<=0,E27,\"X\"), IF(E27>=0,E27,\"max\")))","v":"x"},"x","x","x","x","x","x","x","x","x"]
[null,null,null,{"$f":"J4","v":""},{"$f":"IF(AND(E$60=\"\",$D75=\"\"),\"x\",IF($E$6=\"Min\",IF(E28<=0,E28,\"X\"), IF(E28>=0,E28,\"max\")))","v":"x"},"x","x","x","x","x","x","x","x","x"]
[null,null,null,{"$f":"K4","v":""},{"$f":"IF(AND(E$60=\"\",$D76=\"\"),\"x\",IF($E$6=\"Min\",IF(E29<=0,E29,\"X\"), IF(E29>=0,E29,\"max\")))","v":"x"},"x","x","x","x","x","x","x","x","x"]
[null,null,null,{"$f":"L4","v":""},{"$f":"IF(AND(E$60=\"\",$D77=\"\"),\"x\",IF($E$6=\"Min\",IF(E30<=0,E30,\"X\"), IF(E30>=0,E30,\"max\")))","v":"x"},"x","x","x","x","x","x","x","x","x"]
[null,null,null,{"$f":"M4","v":""},{"$f":"IF(AND(E$60=\"\",$D78=\"\"),\"x\",IF($E$6=\"Min\",IF(E31<=0,E31,\"X\"), IF(E31>=0,E31,\"max\")))","v":"x"},"x","x","x","x","x","x","x","x","x"]
[null,null,null,{"$f":"N4","v":""},{"$f":"IF(AND(E$60=\"\",$D79=\"\"),\"x\",IF($E$6=\"Min\",IF(E32<=0,E32,\"X\"), IF(E32>=0,E32,\"max\")))","v":"x"},"x","x","x","x","x","x","x","x","x"]
[null,null,null,{"$f":"O4","v":""},{"$f":"IF(AND(E$60=\"\",$D80=\"\"),\"x\",IF($E$6=\"Min\",IF(E33<=0,E33,\"X\"), IF(E33>=0,E33,\"max\")))","v":"x"},"x","x","x","x","x","x","x","x","x"]
[null,null,null,{"$f":"P4","v":""},{"$f":"IF(AND(E$60=\"\",$D81=\"\"),\"x\",IF($E$6=\"Min\",IF(E34<=0,E34,\"X\"), IF(E34>=0,E34,\"max\")))","v":"x"},"x","x","x","x","x","x","x","x","x"]
[]
[null,null,{"$f":"IF(E7=\"Min\",MIN(E83:N92)-MAX(E83:N92),MAX(E83:N92)-MIN(E83:N92))","v":0},{"$f":"G4","v":""},"x",{"$f":"IF(AND(F$60=\"\",$D83=\"\"),\"x\",IF($E$7=\"Min\",IF(F36<=0,F36,\"X\"), IF(F36>=0,F36,\"max\")))","v":"x"},{"$f":"IF(AND(G$60=\"\",$D83=\"\"),\"x\",IF($E$7=\"Min\",IF(G36<=0,G36,\"X\"), IF(G36>=0,G36,\"max\")))","v":"x"},"x","x","x","x","x","x","x"]
[null,null,null,{"$f":"H4","v":""},{"$f":"IF(AND(E$60=\"\",$D84=\"\"),\"x\",IF($E$7=\"Min\",IF(E37<=0,E37,\"X\"), IF(E37>=0,E37,\"max\")))","v":"x"},"x","x","x","x","x","x","x","x","x"]
[null,null,null,{"$f":"I4","v":""},{"$f":"IF(AND(E$60=\"\",$D85=\"\"),\"x\",IF($E$7=\"Min\",IF(E38<=0,E38,\"X\"), IF(E38>=0,E38,\"max\")))","v":"x"},"x","x","x","x","x","x","x","x","x"]
[null,null,null,{"$f":"J4","v":""},{"$f":"IF(AND(E$60=\"\",$D86=\"\"),\"x\",IF($E$7=\"Min\",IF(E39<=0,E39,\"X\"), IF(E39>=0,E39,\"max\")))","v":"x"},"x","x","x","x","x","x","x","x","x"]
[null,null,null,{"$f":"K4","v":""},{"$f":"IF(AND(E$60=\"\",$D87=\"\"),\"x\",IF($E$7=\"Min\",IF(E40<=0,E40,\"X\"), IF(E40>=0,E40,\"max\")))","v":"x"},"x","x","x","x","x","x","x","x","x"]
[null,null,null,{"$f":"L4","v":""},{"$f":"IF(AND(E$60=\"\",$D88=\"\"),\"x\",IF($E$7=\"Min\",IF(E41<=0,E41,\"X\"), IF(E41>=0,E41,\"max\")))","v":"x"},"x","x","x","x","x","x","x","x","x"]
[null,null,null,{"$f":"M4","v":""},{"$f":"IF(AND(E$60=\"\",$D89=\"\"),\"x\",IF($E$7=\"Min\",IF(E42<=0,E42,\"X\"), IF(E42>=0,E42,\"max\")))","v":"x"},"x","x","x","x","x","x","x","x","x"]
[null,null,null,{"$f":"N4","v":""},{"$f":"IF(AND(E$60=\"\",$D90=\"\"),\"x\",IF($E$7=\"Min\",IF(E43<=0,E43,\"X\"), IF(E43>=0,E43,\"max\")))","v":"x"},"x","x","x","x","x","x","x","x","x"]
[null,null,null,{"$f":"O4","v":""},{"$f":"IF(AND(E$60=\"\",$D91=\"\"),\"x\",IF($E$7=\"Min\",IF(E44<=0,E44,\"X\"), IF(E44>=0,E44,\"max\")))","v":"x"},"x","x","x","x","x","x","x","x","x"]
[null,null,null,{"$f":"P4","v":""},{"$f":"IF(AND(E$60=\"\",$D92=\"\"),\"x\",IF($E$7=\"Min\",IF(E45<=0,E45,\"X\"), IF(E45>=0,E45,\"max\")))","v":"x"},"x","x","x","x","x","x","x","x","x"]
[]
[null,null,{"$f":"IF(E8=\"Min\",MIN(E94:N103)-MAX(E94:N103),MAX(E94:N103)-MIN(E94:N103))","v":0},{"$f":"G4","v":""},"x",{"$f":"IF(AND(F$60=\"\",$D94=\"\"),\"x\",IF($E$8=\"Min\",IF(F47<=0,F47,\"X\"), IF(F47>=0,F47,\"max\")))","v":"x"},{"$f":"IF(AND(G$60=\"\",$D94=\"\"),\"x\",IF($E$8=\"Min\",IF(G47<=0,G47,\"X\"), IF(G47>=0,G47,\"max\")))","v":"x"},"x","x","x","x","x","x","x"]
[null,null,null,{"$f":"H4","v":""},{"$f":"IF(AND(E$60=\"\",$D95=\"\"),\"x\",IF($E$8=\"Min\",IF(E48<=0,E48,\"X\"), IF(E48>=0,E48,\"max\")))","v":"x"},"x","x","x","x","x","x","x","x","x"]
[null,null,null,{"$f":"I4","v":""},{"$f":"IF(AND(E$60=\"\",$D96=\"\"),\"x\",IF($E$8=\"Min\",IF(E49<=0,E49,\"X\"), IF(E49>=0,E49,\"max\")))","v":"x"},"x","x","x","x","x","x","x","x","x"]
[null,null,null,{"$f":"J4","v":""},{"$f":"IF(AND(E$60=\"\",$D97=\"\"),\"x\",IF($E$8=\"Min\",IF(E50<=0,E50,\"X\"), IF(E50>=0,E50,\"max\")))","v":"x"},"x","x","x","x","x","x","x","x","x"]
[null,null,null,{"$f":"K4","v":""},{"$f":"IF(AND(E$60=\"\",$D98=\"\"),\"x\",IF($E$8=\"Min\",IF(E51<=0,E51,\"X\"), IF(E51>=0,E51,\"max\")))","v":"x"},"x","x","x","x","x","x","x","x","x"]
[null,null,null,{"$f":"L4","v":""},{"$f":"IF(AND(E$60=\"\",$D99=\"\"),\"x\",IF($E$8=\"Min\",IF(E52<=0,E52,\"X\"), IF(E52>=0,E52,\"max\")))","v":"x"},"x","x","x","x","x","x","x","x","x"]
[null,null,null,{"$f":"M4","v":""},{"$f":"IF(AND(E$60=\"\",$D100=\"\"),\"x\",IF($E$8=\"Min\",IF(E53<=0,E53,\"X\"), IF(E53>=0,E53,\"max\")))","v":"x"},"x","x","x","x","x","x","x","x","x"]
[null,null,null,{"$f":"N4","v":""},{"$f":"IF(AND(E$60=\"\",$D101=\"\"),\"x\",IF($E$8=\"Min\",IF(E54<=0,E54,\"X\"), IF(E54>=0,E54,\"max\")))","v":"x"},"x","x","x","x","x","x","x","x","x"]
[null,null,null,{"$f":"O4","v":""},{"$f":"IF(AND(E$60=\"\",$D102=\"\"),\"x\",IF($E$8=\"Min\",IF(E55<=0,E55,\"X\"), IF(E55>=0,E55,\"max\")))","v":"x"},"x","x","x","x","x","x","x","x","x"]
[null,null,null,{"$f":"P4","v":""},{"$f":"IF(AND(E$60=\"\",$D103=\"\"),\"x\",IF($E$8=\"Min\",IF(E56<=0,E56,\"X\"), IF(E56>=0,E56,\"max\")))","v":"x"},"x","x","x","x","x","x","x","x","x"]

{"sheet":"Soc-Loc","index":21,"n_rows":58,"n_cols":43,"rows_kept":58,"cut":false,"hidden":true,"merged":[[21,2,30,2],[37,2,46,2],[48,2,57,2],[1,2,1,38],[8,4,8,13],[8,16,8,25],[8,28,8,37],[10,2,19,2]]}
[]
[null,null,"SOCIAL - LOCAL"]
[null,null,null,null,null,null,{"$f":"IF(G4=\"\",0,1)","v":0},0,0,0,0,0,0,0,0,0,{"$f":"SUM(G3:P3)","v":0}]
[null,{"$f":"SUM(B5:B6)","v":2},null,null,null,null,{"$f":"IF(DonnéesFinales!H$19=\"n/a\",\"\",\"T1\")","v":""},{"$f":"IF(DonnéesFinales!I$19=\"n/a\",\"\",\"T2\")","v":""},{"$f":"IF(DonnéesFinales!J$19=\"n/a\",\"\",\"T3\")","v":""},{"$f":"IF(DonnéesFinales!K$19=\"n/a\",\"\",\"T4\")","v":""},{"$f":"IF(DonnéesFinales!L$19=\"n/a\",\"\",\"T5\")","v":""},{"$f":"IF(DonnéesFinales!M$19=\"n/a\",\"\",\"T6\")","v":""},{"$f":"IF(DonnéesFinales!N$19=\"n/a\",\"\",\"T7\")","v":""},{"$f":"IF(DonnéesFinales!O$19=\"n/a\",\"\",\"T8\")","v":""},{"$f":"IF(DonnéesFinales!P$19=\"n/a\",\"\",\"T9\")","v":""},{"$f":"IF(DonnéesFinales!Q$19=\"n/a\",\"\",\"T10\")","v":""},null,true,false]
[null,{"$f":"IF(Q5=TRUE,1,0)","v":1},{"$f":"DonnéesFinales!D36","v":"Nuisance environnementale sur chantier"},{"$f":"R5+IF(Q5=TRUE,$S$7/$B$4,0%)","v":0.5},{"$f":"DonnéesFinales!F36","v":"Min"},{"$f":"DonnéesFinales!G36","v":"Unité"},{"$f":"IF(OR(DonnéesFinales!$R36=FALSE,G$4=\"\"),0,DonnéesFinales!H36)","v":0},{"$f":"IF(OR(DonnéesFinales!$R36=FALSE,H$4=\"\"),0,DonnéesFinales!I36)","v":0},{"$f":"IF(OR(DonnéesFinales!$R36=FALSE,I$4=\"\"),0,DonnéesFinales!J36)","v":0},{"$f":"IF(OR(DonnéesFinales!$R36=FALSE,J$4=\"\"),0,DonnéesFinales!K36)","v":0},{"$f":"IF(OR(DonnéesFinales!$R36=FALSE,K$4=\"\"),0,DonnéesFinales!L36)","v":0},{"$f":"IF(OR(DonnéesFinales!$R36=FALSE,L$4=\"\"),0,DonnéesFinales!M36)","v":0},{"$f":"IF(OR(DonnéesFinales!$R36=FALSE,M$4=\"\"),0,DonnéesFinales!N36)","v":0},{"$f":"IF(OR(DonnéesFinales!$R36=FALSE,N$4=\"\"),0,DonnéesFinales!O36)","v":0},{"$f":"IF(OR(DonnéesFinales!$R36=FALSE,O$4=\"\"),0,DonnéesFinales!P36)","v":0},{"$f":"IF(OR(DonnéesFinales!$R36=FALSE,P$4=\"\"),0,DonnéesFinales!Q36)","v":0},{"$f":"DonnéesFinales!$R36","v":true},{"$f":"IF(Q5=TRUE,50%,0)","v":0.5},{"$f":"IF(Q5=FALSE,50%,0)","v":0}]
[null,{"$f":"IF(Q6=TRUE,1,0)","v":1},{"$f":"DonnéesFinales!D37","v":"Nuisance environnementale liée au charroi"},{"$f":"R6+IF(Q6=TRUE,$S$7/$B$4,0%)","v":0.5},{"$f":"DonnéesFinales!F37","v":"Min"},{"$f":"DonnéesFinales!G37","v":"Unité"},{"$f":"IF(OR(DonnéesFinales!$R37=FALSE,G$4=\"\"),0,DonnéesFinales!H37)","v":0},{"$f":"IF(OR(DonnéesFinales!$R37=FALSE,H$4=\"\"),0,DonnéesFinales!I37)","v":0},{"$f":"IF(OR(DonnéesFinales!$R37=FALSE,I$4=\"\"),0,DonnéesFinales!J37)","v":0},{"$f":"IF(OR(DonnéesFinales!$R37=FALSE,J$4=\"\"),0,DonnéesFinales!K37)","v":0},{"$f":"IF(OR(DonnéesFinales!$R37=FALSE,K$4=\"\"),0,DonnéesFinales!L37)","v":0},{"$f":"IF(OR(DonnéesFinales!$R37=FALSE,L$4=\"\"),0,DonnéesFinales!M37)","v":0},{"$f":"IF(OR(DonnéesFinales!$R37=FALSE,M$4=\"\"),0,DonnéesFinales!N37)","v":0},{"$f":"IF(OR(DonnéesFinales!$R37=FALSE,N$4=\"\"),0,DonnéesFinales!O37)","v":0},{"$f":"IF(OR(DonnéesFinales!$R37=FALSE,O$4=\"\"),0,DonnéesFinales!P37)","v":0},{"$f":"IF(OR(DonnéesFinales!$R37=FALSE,P$4=\"\"),0,DonnéesFinales!Q37)","v":0},{"$f":"DonnéesFinales!$R37","v":true},{"$f":"IF(Q6=TRUE,50%,0)","v":0.5},{"$f":"IF(Q6=FALSE,50%,0)","v":0}]
[null,null,null,null,null,null,null,null,null,null,null,null,null,null,null,null,null,null,{"$f":"SUM(S5:S6)","v":0}]
[]
[null,null,null,1,"ComSaraison Sar Saire dk(ai,bj)",null,null,null,null,null,null,null,null,null,null,2,"Fonction de Sréférence F(dk(ai,bj))",null,null,null,null,null,null,null,null,null,null,3,"Degrée de Sréférence π(a,b)",null,null,null,null,null,null,null,null,null,null,4,"Flots de surclassement ф(ai,x)"]
[null,null,null,null,"S1","S2","S3","S4","S5","S6","S7","S8","S9","S10",null,null,"S1","S2","S3","S4","S5","S6","S7","S8","S9","S10",null,null,{"$f":"AB11","v":""},{"$f":"AB12","v":""},{"$f":"AB13","v":""},{"$f":"AB14","v":""},{"$f":"AB15","v":""},{"$f":"AB16","v":""},{"$f":"AB17","v":""},{"$f":"AB18","v":""},{"$f":"AB19","v":""},{"$f":"AB20","v":""},null,null,"ф+(x,a)","ф-(a,x)","ф(a,x)"]
[null,{"$f":"$C$38","v":0},{"$f":"C5","v":"Nuisance environnementale sur chantier"},"S1",0,{"$f":"-H5+G5","v":0},{"$f":"-I5+G5","v":0},{"$f":"-J5+G5","v":0},{"$f":"-K5+G5","v":0},{"$f":"-L5+G5","v":0},{"$f":"-M5+G5","v":0},{"$f":"-N5+G5","v":0},{"$f":"-O5+G5","v":0},{"$f":"-P5+G5","v":0},null,"S1",{"$f":"IF(E11>=0,0,1-EXP((-(E11^2))/(2*$B11^2)))","v":0},{"$f":"IF(F11>=0,0,1-EXP((-(F11^2))/(2*$B11^2)))","v":0},0,0,0,0,0,0,0,0,null,{"$f":"IF(DonnéesFinales!H$19=\"n/a\",\"\",\"T1\")","v":""},{"$f":"IF(OR($AB11=\"\",AC$10=\"\"),0,Q11*$D$5+Q22*$D$6)","v":0},{"$f":"IF(OR($AB11=\"\",AD$10=\"\"),0,R11*$D$5+R22*$D$6)","v":0},{"$f":"IF(OR($AB11=\"\",AE$10=\"\"),0,S11*$D$5+S22*$D$6)","v":0},{"$f":"IF(OR($AB11=\"\",AF$10=\"\"),0,T11*$D$5+T22*$D$6)","v":0},{"$f":"IF(OR($AB11=\"\",AG$10=\"\"),0,U11*$D$5+U22*$D$6)","v":0},{"$f":"IF(OR($AB11=\"\",AH$10=\"\"),0,V11*$D$5+V22*$D$6)","v":0},{"$f":"IF(OR($AB11=\"\",AI$10=\"\"),0,W11*$D$5+W22*$D$6)","v":0},{"$f":"IF(OR($AB11=\"\",AJ$10=\"\"),0,X11*$D$5+X22*$D$6)","v":0},{"$f":"IF(OR($AB11=\"\",AK$10=\"\"),0,Y11*$D$5+Y22*$D$6)","v":0},{"$f":"IF(OR($AB11=\"\",AL$10=\"\"),0,Z11*$D$5+Z22*$D$6)","v":0},null,"S1",{"$f":"(1/($Q$3-1))*SUM(AC11:AL11)","v":0},{"$f":"(1/($Q$3-1))*SUM(AC11:AC20)","v":0},{"$f":"AO11-AP11","v":0}]
[null,0,null,"S2",{"$f":"-G5+H5","v":0},0,{"$f":"-I5+H5","v":0},{"$f":"-J5+H5","v":0},{"$f":"-K5+H5","v":0},{"$f":"-L5+H5","v":0},{"$f":"-M5+H5","v":0},{"$f":"-N5+H5","v":0},{"$f":"-O5+H5","v":0},{"$f":"-P5+H5","v":0},null,"S2",{"$f":"IF(E12>=0,0,1-EXP((-(E12^2))/(2*$B12^2)))","v":0},{"$f":"IF(F12>=0,0,1-EXP((-(F12^2))/(2*$B12^2)))","v":0},{"$f":"IF(G12>=0,0,1-EXP((-(G12^2))/(2*$B12^2)))","v":0},{"$f":"IF(H12>=0,0,1-EXP((-(H12^2))/(2*$B12^2)))","v":0},{"$f":"IF(I12>=0,0,1-EXP((-(I12^2))/(2*$B12^2)))","v":0},{"$f":"IF(J12>=0,0,1-EXP((-(J12^2))/(2*$B12^2)))","v":0},{"$f":"IF(K12>=0,0,1-EXP((-(K12^2))/(2*$B12^2)))","v":0},{"$f":"IF(L12>=0,0,1-EXP((-(L12^2))/(2*$B12^2)))","v":0},{"$f":"IF(M12>=0,0,1-EXP((-(M12^2))/(2*$B12^2)))","v":0},{"$f":"IF(N12>=0,0,1-EXP((-(N12^2))/(2*$B12^2)))","v":0},null,{"$f":"IF(DonnéesFinales!I$19=\"n/a\",\"\",\"T2\")","v":""},0,0,0,0,0,0,0,0,0,0,null,"S2",0,{"$f":"(1/($Q$3-1))*SUM(AD11:AD20)","v":0},{"$f":"AO12-AP12","v":0}]
[null,0,null,"S3",{"$f":"-G5+I5","v":0},{"$f":"-H5+I5","v":0},0,{"$f":"-J5+I5","v":0},{"$f":"-K5+I5","v":0},{"$f":"-L5+I5","v":0},{"$f":"-M5+I5","v":0},{"$f":"-N5+I5","v":0},{"$f":"-O5+I5","v":0},{"$f":"-P5+I5","v":0},null,"S3",0,0,0,0,0,0,0,0,0,0,null,{"$f":"IF(DonnéesFinales!J$19=\"n/a\",\"\",\"T3\")","v":""},0,0,0,0,0,0,0,0,0,0,null,"S3",0,{"$f":"(1/($Q$3-1))*SUM(AE11:AE20)","v":0},0]
[null,0,null,"S4",{"$f":"-G5+J5","v":0},{"$f":"-H5+J5","v":0},{"$f":"-I5+J5","v":0},0,{"$f":"-K5+J5","v":0},{"$f":"-L5+J5","v":0},{"$f":"-M5+J5","v":0},{"$f":"-N5+J5","v":0},{"$f":"-O5+J5","v":0},{"$f":"-P5+J5","v":0},null,"S4",0,0,0,0,0,0,0,0,0,0,null,{"$f":"IF(DonnéesFinales!K$19=\"n/a\",\"\",\"T4\")","v":""},0,0,0,0,0,0,0,0,0,0,null,"S4",0,{"$f":"(1/($Q$3-1))*SUM(AF11:AF20)","v":0},0]
[null,0,null,"S5",{"$f":"-G5+K5","v":0},{"$f":"-H5+K5","v":0},{"$f":"-I5+K5","v":0},{"$f":"-J5+K5","v":0},0,{"$f":"-L5+K5","v":0},{"$f":"-M5+K5","v":0},{"$f":"-N5+K5","v":0},{"$f":"-O5+K5","v":0},{"$f":"-P5+K5","v":0},null,"S5",0,0,0,0,0,0,0,0,0,0,null,{"$f":"IF(DonnéesFinales!L$19=\"n/a\",\"\",\"T5\")","v":""},0,0,0,0,0,0,0,0,0,0,null,"S5",0,{"$f":"(1/($Q$3-1))*SUM(AG11:AG20)","v":0},0]
[null,0,null,"S6",{"$f":"-G5+L5","v":0},{"$f":"-H5+L5","v":0},{"$f":"-I5+L5","v":0},{"$f":"-J5+L5","v":0},{"$f":"-K5+L5","v":0},0,{"$f":"-M5+L5","v":0},{"$f":"-N5+L5","v":0},{"$f":"-O5+L5","v":0},{"$f":"-P5+L5","v":0},null,"S6",0,0,0,0,0,0,0,0,0,0,null,{"$f":"IF(DonnéesFinales!M$19=\"n/a\",\"\",\"T6\")","v":""},0,0,0,0,0,0,0,0,0,0,null,"S6",0,{"$f":"(1/($Q$3-1))*SUM(AH11:AH20)","v":0},0]
[null,0,null,"S7",{"$f":"-G5+M5","v":0},{"$f":"-H5+M5","v":0},{"$f":"-I5+M5","v":0},{"$f":"-J5+M5","v":0},{"$f":"-K5+M5","v":0},{"$f":"-L5+M5","v":0},0,{"$f":"-N5+M5","v":0},{"$f":"-O5+M5","v":0},{"$f":"-P5+M5","v":0},null,"S7",0,0,0,0,0,0,0,0,0,0,null,{"$f":"IF(DonnéesFinales!N$19=\"n/a\",\"\",\"T7\")","v":""},0,0,0,0,0,0,0,0,0,0,null,"S7",0,{"$f":"(1/($Q$3-1))*SUM(AI11:AI20)","v":0},0]
[null,0,null,"S8",{"$f":"-G5+N5","v":0},{"$f":"-H5+N5","v":0},{"$f":"-I5+N5","v":0},{"$f":"-J5+N5","v":0},{"$f":"-K5+N5","v":0},{"$f":"-L5+N5","v":0},{"$f":"-M5+N5","v":0},0,{"$f":"-O5+N5","v":0},{"$f":"-P5+N5","v":0},null,"S8",0,0,0,0,0,0,0,0,0,0,null,{"$f":"IF(DonnéesFinales!O$19=\"n/a\",\"\",\"T8\")","v":""},0,0,0,0,0,0,0,0,0,0,null,"S8",0,{"$f":"(1/($Q$3-1))*SUM(AJ11:AJ20)","v":0},0]
[null,0,null,"S9",{"$f":"-G5+O5","v":0},{"$f":"-H5+O5","v":0},{"$f":"-I5+O5","v":0},{"$f":"-J5+O5","v":0},{"$f":"-K5+O5","v":0},{"$f":"-L5+O5","v":0},{"$f":"-M5+O5","v":0},{"$f":"-N5+O5","v":0},0,{"$f":"-P5+O5","v":0},null,"S9",0,0,0,0,0,0,0,0,0,0,null,{"$f":"IF(DonnéesFinales!P$19=\"n/a\",\"\",\"T9\")","v":""},0,0,0,0,0,0,0,0,0,0,null,"S9",0,{"$f":"(1/($Q$3-1))*SUM(AK11:AK20)","v":0},0]
[null,0,null,"S10",{"$f":"-G5+P5","v":0},{"$f":"-H5+P5","v":0},{"$f":"-I5+P5","v":0},{"$f":"-J5+P5","v":0},{"$f":"-K5+P5","v":0},{"$f":"-L5+P5","v":0},{"$f":"-M5+P5","v":0},{"$f":"-N5+P5","v":0},{"$f":"-O5+P5","v":0},0,null,"S10",0,0,0,0,0,0,0,0,0,0,null,{"$f":"IF(DonnéesFinales!Q$19=\"n/a\",\"\",\"T10\")","v":""},0,0,0,0,0,0,0,0,0,0,null,"S10",0,{"$f":"(1/($Q$3-1))*SUM(AL11:AL20)","v":0},0]
[]
[null,{"$f":"$C$49","v":0},{"$f":"C6","v":"Nuisance environnementale liée au charroi"},"S1",0,{"$f":"-H6+G6","v":0},{"$f":"-I6+G6","v":0},{"$f":"-J6+G6","v":0},{"$f":"-K6+G6","v":0},{"$f":"-L6+G6","v":0},{"$f":"-M6+G6","v":0},{"$f":"-N6+G6","v":0},{"$f":"-O6+G6","v":0},{"$f":"-P6+G6","v":0},null,"S1",{"$f":"IF(E22>=0,0,1-EXP((-(E22^2))/(2*$B22^2)))","v":0},{"$f":"IF(F22>=0,0,1-EXP((-(F22^2))/(2*$B22^2)))","v":0},0,0,0,0,0,0,0,0]
[null,0,null,"S2",{"$f":"-G6+H6","v":0},0,{"$f":"-I6+H6","v":0},{"$f":"-J6+H6","v":0},{"$f":"-K6+H6","v":0},{"$f":"-L6+H6","v":0},{"$f":"-M6+H6","v":0},{"$f":"-N6+H6","v":0},{"$f":"-O6+H6","v":0},{"$f":"-P6+H6","v":0},null,"S2",{"$f":"IF(E23>=0,0,1-EXP((-(E23^2))/(2*$B23^2)))","v":0},{"$f":"IF(F23>=0,0,1-EXP((-(F23^2))/(2*$B23^2)))","v":0},{"$f":"IF(G23>=0,0,1-EXP((-(G23^2))/(2*$B23^2)))","v":0},{"$f":"IF(H23>=0,0,1-EXP((-(H23^2))/(2*$B23^2)))","v":0},{"$f":"IF(I23>=0,0,1-EXP((-(I23^2))/(2*$B23^2)))","v":0},{"$f":"IF(J23>=0,0,1-EXP((-(J23^2))/(2*$B23^2)))","v":0},{"$f":"IF(K23>=0,0,1-EXP((-(K23^2))/(2*$B23^2)))","v":0},{"$f":"IF(L23>=0,0,1-EXP((-(L23^2))/(2*$B23^2)))","v":0},{"$f":"IF(M23>=0,0,1-EXP((-(M23^2))/(2*$B23^2)))","v":0},{"$f":"IF(N23>=0,0,1-EXP((-(N23^2))/(2*$B23^2)))","v":0}]
[null,0,null,"S3",{"$f":"-G6+I6","v":0},{"$f":"-H6+I6","v":0},0,{"$f":"-J6+I6","v":0},{"$f":"-K6+I6","v":0},{"$f":"-L6+I6","v":0},{"$f":"-M6+I6","v":0},{"$f":"-N6+I6","v":0},{"$f":"-O6+I6","v":0},{"$f":"-P6+I6","v":0},null,"S3",0,0,0,0,0,0,0,0,0,0]
[null,0,null,"S4",{"$f":"-G6+J6","v":0},{"$f":"-H6+J6","v":0},{"$f":"-I6+J6","v":0},0,{"$f":"-K6+J6","v":0},{"$f":"-L6+J6","v":0},{"$f":"-M6+J6","v":0},{"$f":"-N6+J6","v":0},{"$f":"-O6+J6","v":0},{"$f":"-P6+J6","v":0},null,"S4",0,0,0,0,0,0,0,0,0,0]
[null,0,null,"S5",{"$f":"-G6+K6","v":0},{"$f":"-H6+K6","v":0},{"$f":"-I6+K6","v":0},{"$f":"-J6+K6","v":0},0,{"$f":"-L6+K6","v":0},{"$f":"-M6+K6","v":0},{"$f":"-N6+K6","v":0},{"$f":"-O6+K6","v":0},{"$f":"-P6+K6","v":0},null,"S5",0,0,0,0,0,0,0,0,0,0]
[null,0,null,"S6",{"$f":"-G6+L6","v":0},{"$f":"-H6+L6","v":0},{"$f":"-I6+L6","v":0},{"$f":"-J6+L6","v":0},{"$f":"-K6+L6","v":0},0,{"$f":"-M6+L6","v":0},{"$f":"-N6+L6","v":0},{"$f":"-O6+L6","v":0},{"$f":"-P6+L6","v":0},null,"S6",0,0,0,0,0,0,0,0,0,0]
[null,0,null,"S7",{"$f":"-G6+M6","v":0},{"$f":"-H6+M6","v":0},{"$f":"-I6+M6","v":0},{"$f":"-J6+M6","v":0},{"$f":"-K6+M6","v":0},{"$f":"-L6+M6","v":0},0,{"$f":"-N6+M6","v":0},{"$f":"-O6+M6","v":0},{"$f":"-P6+M6","v":0},null,"S7",0,0,0,0,0,0,0,0,0,0]
[null,0,null,"S8",{"$f":"-G6+N6","v":0},{"$f":"-H6+N6","v":0},{"$f":"-I6+N6","v":0},{"$f":"-J6+N6","v":0},{"$f":"-K6+N6","v":0},{"$f":"-L6+N6","v":0},{"$f":"-M6+N6","v":0},0,{"$f":"-O6+N6","v":0},{"$f":"-P6+N6","v":0},null,"S8",0,0,0,0,0,0,0,0,0,0]
[null,0,null,"S9",{"$f":"-G6+O6","v":0},{"$f":"-H6+O6","v":0},{"$f":"-I6+O6","v":0},{"$f":"-J6+O6","v":0},{"$f":"-K6+O6","v":0},{"$f":"-L6+O6","v":0},{"$f":"-M6+O6","v":0},{"$f":"-N6+O6","v":0},0,{"$f":"-P6+O6","v":0},null,"S9",0,0,0,0,0,0,0,0,0,0]
[null,0,null,"S10",{"$f":"-G6+P6","v":0},{"$f":"-H6+P6","v":0},{"$f":"-I6+P6","v":0},{"$f":"-J6+P6","v":0},{"$f":"-K6+P6","v":0},{"$f":"-L6+P6","v":0},{"$f":"-M6+P6","v":0},{"$f":"-N6+P6","v":0},{"$f":"-O6+P6","v":0},0,null,"S10",0,0,0,0,0,0,0,0,0,0]
[]
[]
[]
[]
[]
[null,null,null,null,{"$f":"G4","v":""},"","","","","","","","",""]
[null,null,{"$f":"IF(E5=\"Min\",(MIN(E38:N47)-MAX(E38:N47))/2,MAX(E38:N47)-MIN(E38:N47))","v":0},{"$f":"G4","v":""},"x",{"$f":"IF(AND(F$37=\"\",$D38=\"\"),\"x\",IF($E$5=\"Min\",IF(F11<=0,F11,\"min\"), IF(F11>=0,F11,\"max\")))","v":"x"},{"$f":"IF(AND(G$37=\"\",$D38=\"\"),\"x\",IF($E$5=\"Min\",IF(G11<=0,G11,\"min\"), IF(G11>=0,G11,\"max\")))","v":"x"},"x","x","x","x","x","x","x"]
[null,null,null,{"$f":"H4","v":""},{"$f":"IF(AND(E$37=\"\",$D39=\"\"),\"x\",IF($E$5=\"Min\",IF(E12<=0,E12,\"min\"), IF(E12>=0,E12,\"max\")))","v":"x"},"x",{"$f":"IF(AND(G$37=\"\",$D39=\"\"),\"x\",IF($E$5=\"Min\",IF(G12<=0,G12,\"min\"), IF(G12>=0,G12,\"max\")))","v":"x"},"x","x","x","x","x","x","x"]
[null,null,null,{"$f":"I4","v":""},{"$f":"IF(AND(E$37=\"\",$D40=\"\"),\"x\",IF($E$5=\"Min\",IF(E13<=0,E13,\"min\"), IF(E13>=0,E13,\"max\")))","v":"x"},{"$f":"IF(AND(F$37=\"\",$D40=\"\"),\"x\",IF($E$5=\"Min\",IF(F13<=0,F13,\"min\"), IF(F13>=0,F13,\"max\")))","v":"x"},"x","x","x","x","x","x","x","x"]
[null,null,null,{"$f":"J4","v":""},{"$f":"IF(AND(E$37=\"\",$D41=\"\"),\"x\",IF($E$5=\"Min\",IF(E14<=0,E14,\"min\"), IF(E14>=0,E14,\"max\")))","v":"x"},{"$f":"IF(AND(F$37=\"\",$D41=\"\"),\"x\",IF($E$5=\"Min\",IF(F14<=0,F14,\"min\"), IF(F14>=0,F14,\"max\")))","v":"x"},"x","x","x","x","x","x","x","x"]
[null,null,null,{"$f":"K4","v":""},{"$f":"IF(AND(E$37=\"\",$D42=\"\"),\"x\",IF($E$5=\"Min\",IF(E15<=0,E15,\"min\"), IF(E15>=0,E15,\"max\")))","v":"x"},{"$f":"IF(AND(F$37=\"\",$D42=\"\"),\"x\",IF($E$5=\"Min\",IF(F15<=0,F15,\"min\"), IF(F15>=0,F15,\"max\")))","v":"x"},"x","x","x","x","x","x","x","x"]
[null,null,null,{"$f":"L4","v":""},{"$f":"IF(AND(E$37=\"\",$D43=\"\"),\"x\",IF($E$5=\"Min\",IF(E16<=0,E16,\"min\"), IF(E16>=0,E16,\"max\")))","v":"x"},{"$f":"IF(AND(F$37=\"\",$D43=\"\"),\"x\",IF($E$5=\"Min\",IF(F16<=0,F16,\"min\"), IF(F16>=0,F16,\"max\")))","v":"x"},"x","x","x","x","x","x","x","x"]
[null,null,null,{"$f":"M4","v":""},{"$f":"IF(AND(E$37=\"\",$D44=\"\"),\"x\",IF($E$5=\"Min\",IF(E17<=0,E17,\"min\"), IF(E17>=0,E17,\"max\")))","v":"x"},{"$f":"IF(AND(F$37=\"\",$D44=\"\"),\"x\",IF($E$5=\"Min\",IF(F17<=0,F17,\"min\"), IF(F17>=0,F17,\"max\")))","v":"x"},"x","x","x","x","x","x","x","x"]
[null,null,null,{"$f":"N4","v":""},{"$f":"IF(AND(E$37=\"\",$D45=\"\"),\"x\",IF($E$5=\"Min\",IF(E18<=0,E18,\"min\"), IF(E18>=0,E18,\"max\")))","v":"x"},{"$f":"IF(AND(F$37=\"\",$D45=\"\"),\"x\",IF($E$5=\"Min\",IF(F18<=0,F18,\"min\"), IF(F18>=0,F18,\"max\")))","v":"x"},"x","x","x","x","x","x","x","x"]
[null,null,null,{"$f":"O4","v":""},{"$f":"IF(AND(E$37=\"\",$D46=\"\"),\"x\",IF($E$5=\"Min\",IF(E19<=0,E19,\"min\"), IF(E19>=0,E19,\"max\")))","v":"x"},{"$f":"IF(AND(F$37=\"\",$D46=\"\"),\"x\",IF($E$5=\"Min\",IF(F19<=0,F19,\"min\"), IF(F19>=0,F19,\"max\")))","v":"x"},"x","x","x","x","x","x","x","x"]
[null,null,null,{"$f":"P4","v":""},{"$f":"IF(AND(E$37=\"\",$D47=\"\"),\"x\",IF($E$5=\"Min\",IF(E20<=0,E20,\"min\"), IF(E20>=0,E20,\"max\")))","v":"x"},{"$f":"IF(AND(F$37=\"\",$D47=\"\"),\"x\",IF($E$5=\"Min\",IF(F20<=0,F20,\"min\"), IF(F20>=0,F20,\"max\")))","v":"x"},"x","x","x","x","x","x","x","x"]
[]
[null,null,{"$f":"IF(D6=\"Min\",(MIN(E49:N58)-MAX(E49:N58))/2,(MAX(E49:N58)-MIN(E49:N58))/2)","v":0},{"$f":"G4","v":""},"x",{"$f":"IF(AND(F$37=\"\",$D49=\"\"),\"x\",IF($E$6=\"Min\",IF(F22<=0,F22,\"X\"), IF(F22>=0,F22,\"X\")))","v":"x"},{"$f":"IF(AND(G$37=\"\",$D49=\"\"),\"x\",IF($E$6=\"Min\",IF(G22<=0,G22,\"X\"), IF(G22>=0,G22,\"X\")))","v":"x"},"x","x","x","x","x","x","x"]
[null,null,null,{"$f":"H4","v":""},{"$f":"IF(AND(E$37=\"\",$D50=\"\"),\"x\",IF($E$6=\"Min\",IF(E23<=0,E23,\"X\"), IF(E23>=0,E23,\"X\")))","v":"x"},"x","x","x","x","x","x","x","x","x"]
[null,null,null,{"$f":"I4","v":""},{"$f":"IF(AND(E$37=\"\",$D51=\"\"),\"x\",IF($E$6=\"Min\",IF(E24<=0,E24,\"X\"), IF(E24>=0,E24,\"X\")))","v":"x"},"x","x","x","x","x","x","x","x","x"]
[null,null,null,{"$f":"J4","v":""},{"$f":"IF(AND(E$37=\"\",$D52=\"\"),\"x\",IF($E$6=\"Min\",IF(E25<=0,E25,\"X\"), IF(E25>=0,E25,\"X\")))","v":"x"},"x","x","x","x","x","x","x","x","x"]
[null,null,null,{"$f":"K4","v":""},{"$f":"IF(AND(E$37=\"\",$D53=\"\"),\"x\",IF($E$6=\"Min\",IF(E26<=0,E26,\"X\"), IF(E26>=0,E26,\"X\")))","v":"x"},"x","x","x","x","x","x","x","x","x"]
[null,null,null,{"$f":"L4","v":""},{"$f":"IF(AND(E$37=\"\",$D54=\"\"),\"x\",IF($E$6=\"Min\",IF(E27<=0,E27,\"X\"), IF(E27>=0,E27,\"X\")))","v":"x"},"x","x","x","x","x","x","x","x","x"]
[null,null,null,{"$f":"M4","v":""},{"$f":"IF(AND(E$37=\"\",$D55=\"\"),\"x\",IF($E$6=\"Min\",IF(E28<=0,E28,\"X\"), IF(E28>=0,E28,\"X\")))","v":"x"},"x","x","x","x","x","x","x","x","x"]
[null,null,null,{"$f":"N4","v":""},{"$f":"IF(AND(E$37=\"\",$D56=\"\"),\"x\",IF($E$6=\"Min\",IF(E29<=0,E29,\"X\"), IF(E29>=0,E29,\"X\")))","v":"x"},"x","x","x","x","x","x","x","x","x"]
[null,null,null,{"$f":"O4","v":""},{"$f":"IF(AND(E$37=\"\",$D57=\"\"),\"x\",IF($E$6=\"Min\",IF(E30<=0,E30,\"X\"), IF(E30>=0,E30,\"X\")))","v":"x"},"x","x","x","x","x","x","x","x","x"]
[null,null,null,{"$f":"P4","v":""},{"$f":"IF(AND(E$37=\"\",$D58=\"\"),\"x\",IF($E$6=\"Min\",IF(E31<=0,E31,\"X\"), IF(E31>=0,E31,\"X\")))","v":"x"},"x","x","x","x","x","x","x","x","x"]

{"sheet":"Soc-Glob","index":22,"n_rows":57,"n_cols":43,"rows_kept":57,"cut":false,"hidden":true,"merged":[[36,2,45,2],[47,2,56,2],[10,2,19,2],[21,2,30,2],[1,2,1,38],[8,4,8,13],[8,16,8,25],[8,28,8,37],[34,4,34,13]]}
[]
[null,null,"SOCIAL - GLOBAL"]
[null,null,null,null,null,null,{"$f":"IF(G4=\"\",0,1)","v":0},0,0,0,0,0,0,0,0,0,{"$f":"SUM(G3:P3)","v":0}]
[null,{"$f":"SUM(B5:B6)","v":0},null,null,null,null,{"$f":"IF(DonnéesFinales!H$19=\"n/a\",\"\",\"T1\")","v":""},{"$f":"IF(DonnéesFinales!I$19=\"n/a\",\"\",\"T2\")","v":""},{"$f":"IF(DonnéesFinales!J$19=\"n/a\",\"\",\"T3\")","v":""},{"$f":"IF(DonnéesFinales!K$19=\"n/a\",\"\",\"T4\")","v":""},{"$f":"IF(DonnéesFinales!L$19=\"n/a\",\"\",\"T5\")","v":""},{"$f":"IF(DonnéesFinales!M$19=\"n/a\",\"\",\"T6\")","v":""},{"$f":"IF(DonnéesFinales!N$19=\"n/a\",\"\",\"T7\")","v":""},{"$f":"IF(DonnéesFinales!O$19=\"n/a\",\"\",\"T8\")","v":""},{"$f":"IF(DonnéesFinales!P$19=\"n/a\",\"\",\"T9\")","v":""},{"$f":"IF(DonnéesFinales!Q$19=\"n/a\",\"\",\"T10\")","v":""},null,true,false]
[null,{"$f":"IF(Q5=TRUE,1,0)","v":0},{"$f":"DonnéesFinales!D39","v":"Impact paysager"},{"$f":"R5+IF(Q5=TRUE,$S$7/$B$4,0%)","v":0},{"$f":"DonnéesFinales!F39","v":"Min"},{"$f":"DonnéesFinales!G39","v":"Unité"},{"$f":"IF(OR(DonnéesFinales!$R39=FALSE,G$4=\"\"),0,DonnéesFinales!H39)","v":0},{"$f":"IF(OR(DonnéesFinales!$R39=FALSE,H$4=\"\"),0,DonnéesFinales!I39)","v":0},{"$f":"IF(OR(DonnéesFinales!$R39=FALSE,I$4=\"\"),0,DonnéesFinales!J39)","v":0},{"$f":"IF(OR(DonnéesFinales!$R39=FALSE,J$4=\"\"),0,DonnéesFinales!K39)","v":0},{"$f":"IF(OR(DonnéesFinales!$R39=FALSE,K$4=\"\"),0,DonnéesFinales!L39)","v":0},{"$f":"IF(OR(DonnéesFinales!$R39=FALSE,L$4=\"\"),0,DonnéesFinales!M39)","v":0},{"$f":"IF(OR(DonnéesFinales!$R39=FALSE,M$4=\"\"),0,DonnéesFinales!N39)","v":0},{"$f":"IF(OR(DonnéesFinales!$R39=FALSE,N$4=\"\"),0,DonnéesFinales!O39)","v":0},{"$f":"IF(OR(DonnéesFinales!$R39=FALSE,O$4=\"\"),0,DonnéesFinales!P39)","v":0},{"$f":"IF(OR(DonnéesFinales!$R39=FALSE,P$4=\"\"),0,DonnéesFinales!Q39)","v":0},{"$f":"DonnéesFinales!$R39","v":false},{"$f":"IF(Q5=TRUE,54%,0)","v":0},{"$f":"IF(Q5=FALSE,54%,0)","v":0.54}]
[null,{"$f":"IF(Q6=TRUE,1,0)","v":0},{"$f":"DonnéesFinales!D40","v":"Impact patrimonial"},{"$f":"R6+IF(Q6=TRUE,$S$7/$B$4,0%)","v":0},{"$f":"DonnéesFinales!F40","v":"Min"},{"$f":"DonnéesFinales!G40","v":"Unité"},{"$f":"IF(OR(DonnéesFinales!$R40=FALSE,G$4=\"\"),0,DonnéesFinales!H40)","v":0},{"$f":"IF(OR(DonnéesFinales!$R40=FALSE,H$4=\"\"),0,DonnéesFinales!I40)","v":0},{"$f":"IF(OR(DonnéesFinales!$R40=FALSE,I$4=\"\"),0,DonnéesFinales!J40)","v":0},{"$f":"IF(OR(DonnéesFinales!$R40=FALSE,J$4=\"\"),0,DonnéesFinales!K40)","v":0},{"$f":"IF(OR(DonnéesFinales!$R40=FALSE,K$4=\"\"),0,DonnéesFinales!L40)","v":0},{"$f":"IF(OR(DonnéesFinales!$R40=FALSE,L$4=\"\"),0,DonnéesFinales!M40)","v":0},{"$f":"IF(OR(DonnéesFinales!$R40=FALSE,M$4=\"\"),0,DonnéesFinales!N40)","v":0},{"$f":"IF(OR(DonnéesFinales!$R40=FALSE,N$4=\"\"),0,DonnéesFinales!O40)","v":0},{"$f":"IF(OR(DonnéesFinales!$R40=FALSE,O$4=\"\"),0,DonnéesFinales!P40)","v":0},{"$f":"IF(OR(DonnéesFinales!$R40=FALSE,P$4=\"\"),0,DonnéesFinales!Q40)","v":0},{"$f":"DonnéesFinales!$R40","v":false},{"$f":"IF(Q6=TRUE,46%,0)","v":0},{"$f":"IF(Q6=FALSE,46%,0)","v":0.46}]
[null,null,null,null,null,null,null,null,null,null,null,null,null,null,null,null,null,null,{"$f":"SUM(S5:S6)","v":1}]
[]
[null,null,null,1,"Comparaison par paire dk(ai,bj)",null,null,null,null,null,null,null,null,null,null,2,"Fonction de préférence F(dk(ai,bj))",null,null,null,null,null,null,null,null,null,null,3,"Degrée de préférence π(a,b)",null,null,null,null,null,null,null,null,null,null,4,"Flots de surclassement ф(ai,x)"]
[null,null,null,null,"S1","S2","S3","S4","S5","S6","S7","S8","S9","S10",null,null,"S1","S2","S3","S4","S5","S6","S7","S8","S9","S10",null,null,{"$f":"AB11","v":""},{"$f":"AB12","v":""},{"$f":"AB13","v":""},{"$f":"AB14","v":""},{"$f":"AB15","v":""},{"$f":"AB16","v":""},{"$f":"AB17","v":""},{"$f":"AB18","v":""},{"$f":"AB19","v":""},{"$f":"AB20","v":""},null,null,"ф+(x,a)","ф-(a,x)","ф(a,x)"]
[null,{"$f":"$C$37","v":0},{"$f":"C5","v":"Impact paysager"},"S1",0,{"$f":"-H5+G5","v":0},{"$f":"-I5+G5","v":0},{"$f":"-J5+G5","v":0},{"$f":"-K5+G5","v":0},{"$f":"-L5+G5","v":0},{"$f":"-M5+G5","v":0},{"$f":"-N5+G5","v":0},{"$f":"-O5+G5","v":0},{"$f":"-P5+G5","v":0},null,"S1",{"$f":"IF(E11>=0,0,1-EXP((-(E11^2))/(2*$B11^2)))","v":0},{"$f":"IF(F11>=0,0,1-EXP((-(F11^2))/(2*$B11^2)))","v":0},0,0,0,0,0,0,0,0,null,{"$f":"IF(DonnéesFinales!H$19=\"n/a\",\"\",\"T1\")","v":""},{"$f":"IF(OR($AB11=\"\",AC$10=\"\"),0,Q11*$D$5+Q22*$D$6)","v":0},{"$f":"IF(OR($AB11=\"\",AD$10=\"\"),0,R11*$D$5+R22*$D$6)","v":0},{"$f":"IF(OR($AB11=\"\",AE$10=\"\"),0,S11*$D$5+S22*$D$6)","v":0},{"$f":"IF(OR($AB11=\"\",AF$10=\"\"),0,T11*$D$5+T22*$D$6)","v":0},{"$f":"IF(OR($AB11=\"\",AG$10=\"\"),0,U11*$D$5+U22*$D$6)","v":0},{"$f":"IF(OR($AB11=\"\",AH$10=\"\"),0,V11*$D$5+V22*$D$6)","v":0},{"$f":"IF(OR($AB11=\"\",AI$10=\"\"),0,W11*$D$5+W22*$D$6)","v":0},{"$f":"IF(OR($AB11=\"\",AJ$10=\"\"),0,X11*$D$5+X22*$D$6)","v":0},{"$f":"IF(OR($AB11=\"\",AK$10=\"\"),0,Y11*$D$5+Y22*$D$6)","v":0},{"$f":"IF(OR($AB11=\"\",AL$10=\"\"),0,Z11*$D$5+Z22*$D$6)","v":0},null,{"$f":"AB11","v":""},{"$f":"(1/($Q$3-1))*SUM(AC11:AL11)","v":0},{"$f":"(1/($Q$3-1))*SUM(AC11:AC20)","v":0},{"$f":"AO11-AP11","v":0}]
[null,0,null,"S2",{"$f":"-G5+H5","v":0},0,{"$f":"-I5+H5","v":0},{"$f":"-J5+H5","v":0},{"$f":"-K5+H5","v":0},{"$f":"-L5+H5","v":0},{"$f":"-M5+H5","v":0},{"$f":"-N5+H5","v":0},{"$f":"-O5+H5","v":0},{"$f":"-P5+H5","v":0},null,"S2",{"$f":"IF(E12>=0,0,1-EXP((-(E12^2))/(2*$B12^2)))","v":0},{"$f":"IF(F12>=0,0,1-EXP((-(F12^2))/(2*$B12^2)))","v":0},{"$f":"IF(G12>=0,0,1-EXP((-(G12^2))/(2*$B12^2)))","v":0},{"$f":"IF(H12>=0,0,1-EXP((-(H12^2))/(2*$B12^2)))","v":0},{"$f":"IF(I12>=0,0,1-EXP((-(I12^2))/(2*$B12^2)))","v":0},{"$f":"IF(J12>=0,0,1-EXP((-(J12^2))/(2*$B12^2)))","v":0},{"$f":"IF(K12>=0,0,1-EXP((-(K12^2))/(2*$B12^2)))","v":0},{"$f":"IF(L12>=0,0,1-EXP((-(L12^2))/(2*$B12^2)))","v":0},{"$f":"IF(M12>=0,0,1-EXP((-(M12^2))/(2*$B12^2)))","v":0},{"$f":"IF(N12>=0,0,1-EXP((-(N12^2))/(2*$B12^2)))","v":0},null,{"$f":"IF(DonnéesFinales!I$19=\"n/a\",\"\",\"T2\")","v":""},0,0,0,0,0,0,0,0,0,0,null,"",0,{"$f":"(1/($Q$3-1))*SUM(AD11:AD20)","v":0},{"$f":"AO12-AP12","v":0}]
[null,0,null,"S3",{"$f":"-G5+I5","v":0},{"$f":"-H5+I5","v":0},0,{"$f":"-J5+I5","v":0},{"$f":"-K5+I5","v":0},{"$f":"-L5+I5","v":0},{"$f":"-M5+I5","v":0},{"$f":"-N5+I5","v":0},{"$f":"-O5+I5","v":0},{"$f":"-P5+I5","v":0},null,"S3",0,0,0,0,0,0,0,0,0,0,null,{"$f":"IF(DonnéesFinales!J$19=\"n/a\",\"\",\"T3\")","v":""},0,0,0,0,0,0,0,0,0,0,null,"",0,{"$f":"(1/($Q$3-1))*SUM(AE11:AE20)","v":0},0]
[null,0,null,"S4",{"$f":"-G5+J5","v":0},{"$f":"-H5+J5","v":0},{"$f":"-I5+J5","v":0},0,{"$f":"-K5+J5","v":0},{"$f":"-L5+J5","v":0},{"$f":"-M5+J5","v":0},{"$f":"-N5+J5","v":0},{"$f":"-O5+J5","v":0},{"$f":"-P5+J5","v":0},null,"S4",0,0,0,0,0,0,0,0,0,0,null,{"$f":"IF(DonnéesFinales!K$19=\"n/a\",\"\",\"T4\")","v":""},0,0,0,0,0,0,0,0,0,0,null,"",0,{"$f":"(1/($Q$3-1))*SUM(AF11:AF20)","v":0},0]
[null,0,null,"S5",{"$f":"-G5+K5","v":0},{"$f":"-H5+K5","v":0},{"$f":"-I5+K5","v":0},{"$f":"-J5+K5","v":0},0,{"$f":"-L5+K5","v":0},{"$f":"-M5+K5","v":0},{"$f":"-N5+K5","v":0},{"$f":"-O5+K5","v":0},{"$f":"-P5+K5","v":0},null,"S5",0,0,0,0,0,0,0,0,0,0,null,{"$f":"IF(DonnéesFinales!L$19=\"n/a\",\"\",\"T5\")","v":""},0,0,0,0,0,0,0,0,0,0,null,"",0,{"$f":"(1/($Q$3-1))*SUM(AG11:AG20)","v":0},0]
[null,0,null,"S6",{"$f":"-G5+L5","v":0},{"$f":"-H5+L5","v":0},{"$f":"-I5+L5","v":0},{"$f":"-J5+L5","v":0},{"$f":"-K5+L5","v":0},0,{"$f":"-M5+L5","v":0},{"$f":"-N5+L5","v":0},{"$f":"-O5+L5","v":0},{"$f":"-P5+L5","v":0},null,"S6",0,0,0,0,0,0,0,0,0,0,null,{"$f":"IF(DonnéesFinales!M$19=\"n/a\",\"\",\"T6\")","v":""},0,0,0,0,0,0,0,0,0,0,null,"",0,{"$f":"(1/($Q$3-1))*SUM(AH11:AH20)","v":0},0]
[null,0,null,"S7",{"$f":"-G5+M5","v":0},{"$f":"-H5+M5","v":0},{"$f":"-I5+M5","v":0},{"$f":"-J5+M5","v":0},{"$f":"-K5+M5","v":0},{"$f":"-L5+M5","v":0},0,{"$f":"-N5+M5","v":0},{"$f":"-O5+M5","v":0},{"$f":"-P5+M5","v":0},null,"S7",0,0,0,0,0,0,0,0,0,0,null,{"$f":"IF(DonnéesFinales!N$19=\"n/a\",\"\",\"T7\")","v":""},0,0,0,0,0,0,0,0,0,0,null,"",0,{"$f":"(1/($Q$3-1))*SUM(AI11:AI20)","v":0},0]
[null,0,null,"S8",{"$f":"-G5+N5","v":0},{"$f":"-H5+N5","v":0},{"$f":"-I5+N5","v":0},{"$f":"-J5+N5","v":0},{"$f":"-K5+N5","v":0},{"$f":"-L5+N5","v":0},{"$f":"-M5+N5","v":0},0,{"$f":"-O5+N5","v":0},{"$f":"-P5+N5","v":0},null,"S8",0,0,0,0,0,0,0,0,0,0,null,{"$f":"IF(DonnéesFinales!O$19=\"n/a\",\"\",\"T8\")","v":""},0,0,0,0,0,0,0,0,0,0,null,"",0,{"$f":"(1/($Q$3-1))*SUM(AJ11:AJ20)","v":0},0]
[null,0,null,"S9",{"$f":"-G5+O5","v":0},{"$f":"-H5+O5","v":0},{"$f":"-I5+O5","v":0},{"$f":"-J5+O5","v":0},{"$f":"-K5+O5","v":0},{"$f":"-L5+O5","v":0},{"$f":"-M5+O5","v":0},{"$f":"-N5+O5","v":0},0,{"$f":"-P5+O5","v":0},null,"S9",0,0,0,0,0,0,0,0,0,0,null,{"$f":"IF(DonnéesFinales!P$19=\"n/a\",\"\",\"T9\")","v":""},0,0,0,0,0,0,0,0,0,0,null,"",0,{"$f":"(1/($Q$3-1))*SUM(AK11:AK20)","v":0},0]
[null,0,null,"S10",{"$f":"-G5+P5","v":0},{"$f":"-H5+P5","v":0},{"$f":"-I5+P5","v":0},{"$f":"-J5+P5","v":0},{"$f":"-K5+P5","v":0},{"$f":"-L5+P5","v":0},{"$f":"-M5+P5","v":0},{"$f":"-N5+P5","v":0},{"$f":"-O5+P5","v":0},0,null,"S10",0,0,0,0,0,0,0,0,0,0,null,{"$f":"IF(DonnéesFinales!Q$19=\"n/a\",\"\",\"T10\")","v":""},0,0,0,0,0,0,0,0,0,0,null,"",0,{"$f":"(1/($Q$3-1))*SUM(AL11:AL20)","v":0},0]
[]
[null,{"$f":"$C$48","v":0},{"$f":"C6","v":"Impact patrimonial"},"S1",0,{"$f":"-H6+G6","v":0},{"$f":"-I6+G6","v":0},{"$f":"-J6+G6","v":0},{"$f":"-K6+G6","v":0},{"$f":"-L6+G6","v":0},{"$f":"-M6+G6","v":0},{"$f":"-N6+G6","v":0},{"$f":"-O6+G6","v":0},{"$f":"-P6+G6","v":0},null,"S1",{"$f":"IF(E22>=0,0,1-EXP((-(E22^2))/(2*$B22^2)))","v":0},{"$f":"IF(F22>=0,0,1-EXP((-(F22^2))/(2*$B22^2)))","v":0},0,0,0,0,0,0,0,0]
[null,0,null,"S2",{"$f":"-G6+H6","v":0},0,{"$f":"-I6+H6","v":0},{"$f":"-J6+H6","v":0},{"$f":"-K6+H6","v":0},{"$f":"-L6+H6","v":0},{"$f":"-M6+H6","v":0},{"$f":"-N6+H6","v":0},{"$f":"-O6+H6","v":0},{"$f":"-P6+H6","v":0},null,"S2",{"$f":"IF(E23>=0,0,1-EXP((-(E23^2))/(2*$B23^2)))","v":0},{"$f":"IF(F23>=0,0,1-EXP((-(F23^2))/(2*$B23^2)))","v":0},{"$f":"IF(G23>=0,0,1-EXP((-(G23^2))/(2*$B23^2)))","v":0},{"$f":"IF(H23>=0,0,1-EXP((-(H23^2))/(2*$B23^2)))","v":0},{"$f":"IF(I23>=0,0,1-EXP((-(I23^2))/(2*$B23^2)))","v":0},{"$f":"IF(J23>=0,0,1-EXP((-(J23^2))/(2*$B23^2)))","v":0},{"$f":"IF(K23>=0,0,1-EXP((-(K23^2))/(2*$B23^2)))","v":0},{"$f":"IF(L23>=0,0,1-EXP((-(L23^2))/(2*$B23^2)))","v":0},{"$f":"IF(M23>=0,0,1-EXP((-(M23^2))/(2*$B23^2)))","v":0},{"$f":"IF(N23>=0,0,1-EXP((-(N23^2))/(2*$B23^2)))","v":0}]
[null,0,null,"S3",{"$f":"-G6+I6","v":0},{"$f":"-H6+I6","v":0},0,{"$f":"-J6+I6","v":0},{"$f":"-K6+I6","v":0},{"$f":"-L6+I6","v":0},{"$f":"-M6+I6","v":0},{"$f":"-N6+I6","v":0},{"$f":"-O6+I6","v":0},{"$f":"-P6+I6","v":0},null,"S3",0,0,0,0,0,0,0,0,0,0]
[null,0,null,"S4",{"$f":"-G6+J6","v":0},{"$f":"-H6+J6","v":0},{"$f":"-I6+J6","v":0},0,{"$f":"-K6+J6","v":0},{"$f":"-L6+J6","v":0},{"$f":"-M6+J6","v":0},{"$f":"-N6+J6","v":0},{"$f":"-O6+J6","v":0},{"$f":"-P6+J6","v":0},null,"S4",0,0,0,0,0,0,0,0,0,0]
[null,0,null,"S5",{"$f":"-G6+K6","v":0},{"$f":"-H6+K6","v":0},{"$f":"-I6+K6","v":0},{"$f":"-J6+K6","v":0},0,{"$f":"-L6+K6","v":0},{"$f":"-M6+K6","v":0},{"$f":"-N6+K6","v":0},{"$f":"-O6+K6","v":0},{"$f":"-P6+K6","v":0},null,"S5",0,0,0,0,0,0,0,0,0,0]
[null,0,null,"S6",{"$f":"-G6+L6","v":0},{"$f":"-H6+L6","v":0},{"$f":"-I6+L6","v":0},{"$f":"-J6+L6","v":0},{"$f":"-K6+L6","v":0},0,{"$f":"-M6+L6","v":0},{"$f":"-N6+L6","v":0},{"$f":"-O6+L6","v":0},{"$f":"-P6+L6","v":0},null,"S6",0,0,0,0,0,0,0,0,0,0]
[null,0,null,"S7",{"$f":"-G6+M6","v":0},{"$f":"-H6+M6","v":0},{"$f":"-I6+M6","v":0},{"$f":"-J6+M6","v":0},{"$f":"-K6+M6","v":0},{"$f":"-L6+M6","v":0},0,{"$f":"-N6+M6","v":0},{"$f":"-O6+M6","v":0},{"$f":"-P6+M6","v":0},null,"S7",0,0,0,0,0,0,0,0,0,0]
[null,0,null,"S8",{"$f":"-G6+N6","v":0},{"$f":"-H6+N6","v":0},{"$f":"-I6+N6","v":0},{"$f":"-J6+N6","v":0},{"$f":"-K6+N6","v":0},{"$f":"-L6+N6","v":0},{"$f":"-M6+N6","v":0},0,{"$f":"-O6+N6","v":0},{"$f":"-P6+N6","v":0},null,"S8",0,0,0,0,0,0,0,0,0,0]
[null,0,null,"S9",{"$f":"-G6+O6","v":0},{"$f":"-H6+O6","v":0},{"$f":"-I6+O6","v":0},{"$f":"-J6+O6","v":0},{"$f":"-K6+O6","v":0},{"$f":"-L6+O6","v":0},{"$f":"-M6+O6","v":0},{"$f":"-N6+O6","v":0},0,{"$f":"-P6+O6","v":0},null,"S9",0,0,0,0,0,0,0,0,0,0]
[null,0,null,"S10",{"$f":"-G6+P6","v":0},{"$f":"-H6+P6","v":0},{"$f":"-I6+P6","v":0},{"$f":"-J6+P6","v":0},{"$f":"-K6+P6","v":0},{"$f":"-L6+P6","v":0},{"$f":"-M6+P6","v":0},{"$f":"-N6+P6","v":0},{"$f":"-O6+P6","v":0},0,null,"S10",0,0,0,0,0,0,0,0,0,0]
[]
[]
[]
[null,null,null,1,"Comparaison par paire dk(ai,bj)"]
[null,null,null,null,{"$f":"G4","v":""},"","","","","","","","",""]
[null,null,{"$f":"IF(E5=\"Min\",(MIN(E37:N46)-MAX(E37:N46))/2,(MAX(E37:N46)-MIN(E37:N46))/2)","v":0},{"$f":"G4","v":""},"x",{"$f":"IF(AND(F$36=\"\",$D37=\"\"),\"x\",IF($E$5=\"Min\",IF(F11<=0,F11,\"X\"), IF(F11>=0,\"X\",F11)))","v":"x"},"x","x","x","x","x","x","x","x"]
[null,null,null,{"$f":"H4","v":""},{"$f":"IF(AND(E$36=\"\",$D38=\"\"),\"x\",IF($E$5=\"Min\",IF(E12<=0,E12,\"X\"), IF(E12>=0,\"X\",E12)))","v":"x"},"x",{"$f":"IF(AND(G$36=\"\",$D38=\"\"),\"x\",IF($E$5=\"Min\",IF(G12<=0,G12,\"X\"), IF(G12>=0,\"X\",G12)))","v":"x"},"x","x","x","x","x","x","x"]
[null,null,null,{"$f":"I4","v":""},"x",{"$f":"IF(AND(F$36=\"\",$D39=\"\"),\"x\",IF($E$5=\"Min\",IF(F13<=0,F13,\"X\"), IF(F13>=0,\"X\",F13)))","v":"x"},"x",{"$f":"IF(AND(H$36=\"\",$D39=\"\"),\"x\",IF($E$5=\"Min\",IF(H13<=0,H13,\"X\"), IF(H13>=0,\"X\",H13)))","v":"x"},"x","x","x","x","x","x"]
[null,null,null,{"$f":"J4","v":""},"x","x",{"$f":"IF(AND(G$36=\"\",$D40=\"\"),\"x\",IF($E$5=\"Min\",IF(G14<=0,G14,\"X\"), IF(G14>=0,\"X\",G14)))","v":"x"},"x",{"$f":"IF(AND(I$36=\"\",$D40=\"\"),\"x\",IF($E$5=\"Min\",IF(I14<=0,I14,\"X\"), IF(I14>=0,\"X\",I14)))","v":"x"},"x","x","x","x","x"]
[null,null,null,{"$f":"K4","v":""},"x","x","x",{"$f":"IF(AND(H$36=\"\",$D41=\"\"),\"x\",IF($E$5=\"Min\",IF(H15<=0,H15,\"X\"), IF(H15>=0,\"X\",H15)))","v":"x"},"x",{"$f":"IF(AND(J$36=\"\",$D41=\"\"),\"x\",IF($E$5=\"Min\",IF(J15<=0,J15,\"X\"), IF(J15>=0,\"X\",J15)))","v":"x"},{"$f":"IF(AND(K$36=\"\",$D41=\"\"),\"x\",IF($E$5=\"Min\",IF(K15<=0,K15,\"X\"), IF(K15>=0,\"X\",K15)))","v":"x"},{"$f":"IF(AND(L$36=\"\",$D41=\"\"),\"x\",IF($E$5=\"Min\",IF(L15<=0,L15,\"X\"), IF(L15>=0,\"X\",L15)))","v":"x"},{"$f":"IF(AND(M$36=\"\",$D41=\"\"),\"x\",IF($E$5=\"Min\",IF(M15<=0,M15,\"X\"), IF(M15>=0,\"X\",M15)))","v":"x"},{"$f":"IF(AND(N$36=\"\",$D41=\"\"),\"x\",IF($E$5=\"Min\",IF(N15<=0,N15,\"X\"), IF(N15>=0,\"X\",N15)))","v":"x"}]
[null,null,null,{"$f":"L4","v":""},"x","x","x","x",{"$f":"IF(AND(I$36=\"\",$D42=\"\"),\"x\",IF($E$5=\"Min\",IF(I16<=0,I16,\"X\"), IF(I16>=0,\"X\",I16)))","v":"x"},"x",{"$f":"IF(AND(K$36=\"\",$D42=\"\"),\"x\",IF($E$5=\"Min\",IF(K16<=0,K16,\"X\"), IF(K16>=0,\"X\",K16)))","v":"x"},{"$f":"IF(AND(L$36=\"\",$D42=\"\"),\"x\",IF($E$5=\"Min\",IF(L16<=0,L16,\"X\"), IF(L16>=0,\"X\",L16)))","v":"x"},{"$f":"IF(AND(M$36=\"\",$D42=\"\"),\"x\",IF($E$5=\"Min\",IF(M16<=0,M16,\"X\"), IF(M16>=0,\"X\",M16)))","v":"x"},{"$f":"IF(AND(N$36=\"\",$D42=\"\"),\"x\",IF($E$5=\"Min\",IF(N16<=0,N16,\"X\"), IF(N16>=0,\"X\",N16)))","v":"x"}]
[null,null,null,{"$f":"M4","v":""},"x","x","x","x",{"$f":"IF(AND(I$36=\"\",$D43=\"\"),\"x\",IF($E$5=\"Min\",IF(I17<=0,I17,\"X\"), IF(I17>=0,\"X\",I17)))","v":"x"},{"$f":"IF(AND(J$36=\"\",$D43=\"\"),\"x\",IF($E$5=\"Min\",IF(J17<=0,J17,\"X\"), IF(J17>=0,\"X\",J17)))","v":"x"},"x",{"$f":"IF(AND(L$36=\"\",$D43=\"\"),\"x\",IF($E$5=\"Min\",IF(L17<=0,L17,\"X\"), IF(L17>=0,\"X\",L17)))","v":"x"},{"$f":"IF(AND(M$36=\"\",$D43=\"\"),\"x\",IF($E$5=\"Min\",IF(M17<=0,M17,\"X\"), IF(M17>=0,\"X\",M17)))","v":"x"},{"$f":"IF(AND(N$36=\"\",$D43=\"\"),\"x\",IF($E$5=\"Min\",IF(N17<=0,N17,\"X\"), IF(N17>=0,\"X\",N17)))","v":"x"}]
[null,null,null,{"$f":"N4","v":""},"x","x","x","x",{"$f":"IF(AND(I$36=\"\",$D44=\"\"),\"x\",IF($E$5=\"Min\",IF(I18<=0,I18,\"X\"), IF(I18>=0,\"X\",I18)))","v":"x"},{"$f":"IF(AND(J$36=\"\",$D44=\"\"),\"x\",IF($E$5=\"Min\",IF(J18<=0,J18,\"X\"), IF(J18>=0,\"X\",J18)))","v":"x"},{"$f":"IF(AND(K$36=\"\",$D44=\"\"),\"x\",IF($E$5=\"Min\",IF(K18<=0,K18,\"X\"), IF(K18>=0,\"X\",K18)))","v":"x"},"x",{"$f":"IF(AND(M$36=\"\",$D44=\"\"),\"x\",IF($E$5=\"Min\",IF(M18<=0,M18,\"X\"), IF(M18>=0,\"X\",M18)))","v":"x"},{"$f":"IF(AND(N$36=\"\",$D44=\"\"),\"x\",IF($E$5=\"Min\",IF(N18<=0,N18,\"X\"), IF(N18>=0,\"X\",N18)))","v":"x"}]
[null,null,null,{"$f":"O4","v":""},"x","x","x","x",{"$f":"IF(AND(I$36=\"\",$D45=\"\"),\"x\",IF($E$5=\"Min\",IF(I19<=0,I19,\"X\"), IF(I19>=0,\"X\",I19)))","v":"x"},{"$f":"IF(AND(J$36=\"\",$D45=\"\"),\"x\",IF($E$5=\"Min\",IF(J19<=0,J19,\"X\"), IF(J19>=0,\"X\",J19)))","v":"x"},{"$f":"IF(AND(K$36=\"\",$D45=\"\"),\"x\",IF($E$5=\"Min\",IF(K19<=0,K19,\"X\"), IF(K19>=0,\"X\",K19)))","v":"x"},{"$f":"IF(AND(L$36=\"\",$D45=\"\"),\"x\",IF($E$5=\"Min\",IF(L19<=0,L19,\"X\"), IF(L19>=0,\"X\",L19)))","v":"x"},"x",{"$f":"IF(AND(N$36=\"\",$D45=\"\"),\"x\",IF($E$5=\"Min\",IF(N19<=0,N19,\"X\"), IF(N19>=0,\"X\",N19)))","v":"x"}]
[null,null,null,{"$f":"P4","v":""},"x","x","x","x",{"$f":"IF(AND(I$36=\"\",$D46=\"\"),\"x\",IF($E$5=\"Min\",IF(I20<=0,I20,\"X\"), IF(I20>=0,\"X\",I20)))","v":"x"},{"$f":"IF(AND(J$36=\"\",$D46=\"\"),\"x\",IF($E$5=\"Min\",IF(J20<=0,J20,\"X\"), IF(J20>=0,\"X\",J20)))","v":"x"},{"$f":"IF(AND(K$36=\"\",$D46=\"\"),\"x\",IF($E$5=\"Min\",IF(K20<=0,K20,\"X\"), IF(K20>=0,\"X\",K20)))","v":"x"},{"$f":"IF(AND(L$36=\"\",$D46=\"\"),\"x\",IF($E$5=\"Min\",IF(L20<=0,L20,\"X\"), IF(L20>=0,\"X\",L20)))","v":"x"},{"$f":"IF(AND(M$36=\"\",$D46=\"\"),\"x\",IF($E$5=\"Min\",IF(M20<=0,M20,\"X\"), IF(M20>=0,\"X\",M20)))","v":"x"},"x"]
[]
[null,null,{"$f":"IF(E6=\"Min\",(MIN(E48:N57)-MAX(E48:N57))/2,(MAX(E48:N57)-MIN(E48:N57))/2)","v":0},{"$f":"G4","v":""},"x",{"$f":"IF(AND(F$36=\"\",$D48=\"\"),\"x\",IF($E$6=\"Min\",IF(F22<=0,F22,\"X\"), IF(F22>=0,\"X\",F22)))","v":"x"},"x","x","x","x","x","x","x","x"]
[null,null,null,{"$f":"H4","v":""},{"$f":"IF(AND(E$36=\"\",$D49=\"\"),\"x\",IF($E$6=\"Min\",IF(E23<=0,E23,\"X\"), IF(E23>=0,\"X\",E23)))","v":"x"},"x",{"$f":"IF(AND(G$36=\"\",$D49=\"\"),\"x\",IF($E$6=\"Min\",IF(G23<=0,G23,\"X\"), IF(G23>=0,\"X\",G23)))","v":"x"},"x","x","x","x","x","x","x"]
[null,null,null,{"$f":"I4","v":""},"x",{"$f":"IF(AND(F$36=\"\",$D50=\"\"),\"x\",IF($E$6=\"Min\",IF(F24<=0,F24,\"X\"), IF(F24>=0,\"X\",F24)))","v":"x"},"x",{"$f":"IF(AND(H$36=\"\",$D50=\"\"),\"x\",IF($E$6=\"Min\",IF(H24<=0,H24,\"X\"), IF(H24>=0,\"X\",H24)))","v":"x"},"x","x","x","x","x","x"]
[null,null,null,{"$f":"J4","v":""},"x","x",{"$f":"IF(AND(G$36=\"\",$D51=\"\"),\"x\",IF($E$6=\"Min\",IF(G25<=0,G25,\"X\"), IF(G25>=0,\"X\",G25)))","v":"x"},"x",{"$f":"IF(AND(I$36=\"\",$D51=\"\"),\"x\",IF($E$6=\"Min\",IF(I25<=0,I25,\"X\"), IF(I25>=0,\"X\",I25)))","v":"x"},"x","x","x","x","x"]
[null,null,null,{"$f":"K4","v":""},"x","x","x",{"$f":"IF(AND(H$36=\"\",$D52=\"\"),\"x\",IF($E$6=\"Min\",IF(H26<=0,H26,\"X\"), IF(H26>=0,\"X\",H26)))","v":"x"},"x",{"$f":"IF(AND(J$36=\"\",$D52=\"\"),\"x\",IF($E$6=\"Min\",IF(J26<=0,J26,\"X\"), IF(J26>=0,\"X\",J26)))","v":"x"},{"$f":"IF(AND(K$36=\"\",$D52=\"\"),\"x\",IF($E$6=\"Min\",IF(K26<=0,K26,\"X\"), IF(K26>=0,\"X\",K26)))","v":"x"},{"$f":"IF(AND(L$36=\"\",$D52=\"\"),\"x\",IF($E$6=\"Min\",IF(L26<=0,L26,\"X\"), IF(L26>=0,\"X\",L26)))","v":"x"},{"$f":"IF(AND(M$36=\"\",$D52=\"\"),\"x\",IF($E$6=\"Min\",IF(M26<=0,M26,\"X\"), IF(M26>=0,\"X\",M26)))","v":"x"},{"$f":"IF(AND(N$36=\"\",$D52=\"\"),\"x\",IF($E$6=\"Min\",IF(N26<=0,N26,\"X\"), IF(N26>=0,\"X\",N26)))","v":"x"}]
[null,null,null,{"$f":"L4","v":""},"x","x","x","x",{"$f":"IF(AND(I$36=\"\",$D53=\"\"),\"x\",IF($E$6=\"Min\",IF(I27<=0,I27,\"X\"), IF(I27>=0,\"X\",I27)))","v":"x"},"x",{"$f":"IF(AND(K$36=\"\",$D53=\"\"),\"x\",IF($E$6=\"Min\",IF(K27<=0,K27,\"X\"), IF(K27>=0,\"X\",K27)))","v":"x"},{"$f":"IF(AND(L$36=\"\",$D53=\"\"),\"x\",IF($E$6=\"Min\",IF(L27<=0,L27,\"X\"), IF(L27>=0,\"X\",L27)))","v":"x"},{"$f":"IF(AND(M$36=\"\",$D53=\"\"),\"x\",IF($E$6=\"Min\",IF(M27<=0,M27,\"X\"), IF(M27>=0,\"X\",M27)))","v":"x"},{"$f":"IF(AND(N$36=\"\",$D53=\"\"),\"x\",IF($E$6=\"Min\",IF(N27<=0,N27,\"X\"), IF(N27>=0,\"X\",N27)))","v":"x"}]
[null,null,null,{"$f":"M4","v":""},"x","x","x","x",{"$f":"IF(AND(I$36=\"\",$D54=\"\"),\"x\",IF($E$6=\"Min\",IF(I28<=0,I28,\"X\"), IF(I28>=0,\"X\",I28)))","v":"x"},{"$f":"IF(AND(J$36=\"\",$D54=\"\"),\"x\",IF($E$6=\"Min\",IF(J28<=0,J28,\"X\"), IF(J28>=0,\"X\",J28)))","v":"x"},"x",{"$f":"IF(AND(L$36=\"\",$D54=\"\"),\"x\",IF($E$6=\"Min\",IF(L28<=0,L28,\"X\"), IF(L28>=0,\"X\",L28)))","v":"x"},{"$f":"IF(AND(M$36=\"\",$D54=\"\"),\"x\",IF($E$6=\"Min\",IF(M28<=0,M28,\"X\"), IF(M28>=0,\"X\",M28)))","v":"x"},{"$f":"IF(AND(N$36=\"\",$D54=\"\"),\"x\",IF($E$6=\"Min\",IF(N28<=0,N28,\"X\"), IF(N28>=0,\"X\",N28)))","v":"x"}]
[null,null,null,{"$f":"N4","v":""},"x","x","x","x",{"$f":"IF(AND(I$36=\"\",$D55=\"\"),\"x\",IF($E$6=\"Min\",IF(I29<=0,I29,\"X\"), IF(I29>=0,\"X\",I29)))","v":"x"},{"$f":"IF(AND(J$36=\"\",$D55=\"\"),\"x\",IF($E$6=\"Min\",IF(J29<=0,J29,\"X\"), IF(J29>=0,\"X\",J29)))","v":"x"},{"$f":"IF(AND(K$36=\"\",$D55=\"\"),\"x\",IF($E$6=\"Min\",IF(K29<=0,K29,\"X\"), IF(K29>=0,\"X\",K29)))","v":"x"},"x",{"$f":"IF(AND(M$36=\"\",$D55=\"\"),\"x\",IF($E$6=\"Min\",IF(M29<=0,M29,\"X\"), IF(M29>=0,\"X\",M29)))","v":"x"},{"$f":"IF(AND(N$36=\"\",$D55=\"\"),\"x\",IF($E$6=\"Min\",IF(N29<=0,N29,\"X\"), IF(N29>=0,\"X\",N29)))","v":"x"}]
[null,null,null,{"$f":"O4","v":""},"x","x","x","x",{"$f":"IF(AND(I$36=\"\",$D56=\"\"),\"x\",IF($E$6=\"Min\",IF(I30<=0,I30,\"X\"), IF(I30>=0,\"X\",I30)))","v":"x"},{"$f":"IF(AND(J$36=\"\",$D56=\"\"),\"x\",IF($E$6=\"Min\",IF(J30<=0,J30,\"X\"), IF(J30>=0,\"X\",J30)))","v":"x"},{"$f":"IF(AND(K$36=\"\",$D56=\"\"),\"x\",IF($E$6=\"Min\",IF(K30<=0,K30,\"X\"), IF(K30>=0,\"X\",K30)))","v":"x"},{"$f":"IF(AND(L$36=\"\",$D56=\"\"),\"x\",IF($E$6=\"Min\",IF(L30<=0,L30,\"X\"), IF(L30>=0,\"X\",L30)))","v":"x"},"x",{"$f":"IF(AND(N$36=\"\",$D56=\"\"),\"x\",IF($E$6=\"Min\",IF(N30<=0,N30,\"X\"), IF(N30>=0,\"X\",N30)))","v":"x"}]
[null,null,null,{"$f":"P4","v":""},"x","x","x","x",{"$f":"IF(AND(I$36=\"\",$D57=\"\"),\"x\",IF($E$6=\"Min\",IF(I31<=0,I31,\"X\"), IF(I31>=0,\"X\",I31)))","v":"x"},{"$f":"IF(AND(J$36=\"\",$D57=\"\"),\"x\",IF($E$6=\"Min\",IF(J31<=0,J31,\"X\"), IF(J31>=0,\"X\",J31)))","v":"x"},{"$f":"IF(AND(K$36=\"\",$D57=\"\"),\"x\",IF($E$6=\"Min\",IF(K31<=0,K31,\"X\"), IF(K31>=0,\"X\",K31)))","v":"x"},{"$f":"IF(AND(L$36=\"\",$D57=\"\"),\"x\",IF($E$6=\"Min\",IF(L31<=0,L31,\"X\"), IF(L31>=0,\"X\",L31)))","v":"x"},{"$f":"IF(AND(M$36=\"\",$D57=\"\"),\"x\",IF($E$6=\"Min\",IF(M31<=0,M31,\"X\"), IF(M31>=0,\"X\",M31)))","v":"x"},"x"]